I found a way to exclude unnecessary stuff from the grep.
What looks important
Both sdbi and sdbj are part of the boot-pool for TrueNAS. They’re also directly connected via SATA through a SlimSAS cable. So they’re not on the LSI cards.
I could just as well swap the drives if they’re being problematic. I bought these 60GB Corsair Force GT as refurbs in 2014, so it wouldn’t surprise me if they’re sketch.
Either way, I don’t think these issues harm my main array.
Feb 14 03:54:07 storeman smartd[21882]: Device: /dev/sdbi [SAT], SMART Prefailure Attribute: 1 Raw_Read_Error_Rate changed from 104 to 106
Feb 14 03:54:07 storeman smartd[21882]: Device: /dev/sdbi [SAT], SMART Prefailure Attribute: 1 Raw_Read_Error_Rate changed from 104 to 106
Feb 14 03:54:07 storeman smartd[21882]: Device: /dev/sdbj [SAT], SMART Prefailure Attribute: 1 Raw_Read_Error_Rate changed from 104 to 106
Feb 14 03:54:07 storeman smartd[21882]: Device: /dev/sdbj [SAT], SMART Prefailure Attribute: 1 Raw_Read_Error_Rate changed from 104 to 106
Feb 10 02:54:07 storeman smartd[21882]: Device: /dev/sdbj [SAT], SMART Prefailure Attribute: 1 Raw_Read_Error_Rate changed from 102 to 104
Feb 10 02:54:07 storeman smartd[21882]: Device: /dev/sdbj [SAT], SMART Prefailure Attribute: 1 Raw_Read_Error_Rate changed from 102 to 104
Feb 07 03:54:07 storeman smartd[21882]: Device: /dev/sdbi [SAT], SMART Usage Attribute: 195 ECC_Uncorr_Error_Count changed from 100 to 120
Feb 07 03:54:07 storeman smartd[21882]: Device: /dev/sdbi [SAT], SMART Prefailure Attribute: 1 Raw_Read_Error_Rate changed from 120 to 104
Feb 07 03:54:07 storeman smartd[21882]: Device: /dev/sdbi [SAT], SMART Usage Attribute: 195 ECC_Uncorr_Error_Count changed from 100 to 120
Feb 07 03:54:07 storeman smartd[21882]: Device: /dev/sdbi [SAT], SMART Prefailure Attribute: 1 Raw_Read_Error_Rate changed from 120 to 104
Feb 07 03:54:07 storeman smartd[21882]: Device: /dev/sdbj [SAT], SMART Usage Attribute: 195 ECC_Uncorr_Error_Count changed from 100 to 120
Feb 07 03:54:07 storeman smartd[21882]: Device: /dev/sdbj [SAT], SMART Prefailure Attribute: 1 Raw_Read_Error_Rate changed from 120 to 102
Feb 07 03:54:07 storeman smartd[21882]: Device: /dev/sdbj [SAT], SMART Usage Attribute: 195 ECC_Uncorr_Error_Count changed from 100 to 120
Feb 07 03:54:07 storeman smartd[21882]: Device: /dev/sdbj [SAT], SMART Prefailure Attribute: 1 Raw_Read_Error_Rate changed from 120 to 102
Full log
I had DVD and Blu-Ray drives connected to rip some discs for Plex. Those aren’t connected anymore which explains the /dev/sr* errors.
# journalctl -r | grep -i error | grep -wv kube | grep -wv k3s
Feb 15 04:29:12 storeman dockerd[26348]: time="2023-02-15T04:29:12.183805455-06:00" level=error msg="Unable to determine real path of /dev/sr2 for validation"
Feb 15 04:29:12 storeman dockerd[26348]: time="2023-02-15T04:29:12.183794995-06:00" level=error msg="Unable to determine real path of /dev/sr1 for validation"
Feb 15 04:29:12 storeman dockerd[26348]: time="2023-02-15T04:29:12.183765224-06:00" level=error msg="Unable to determine real path of /dev/sr0 for validation"
Feb 14 03:54:07 storeman smartd[21882]: Device: /dev/sdbi [SAT], SMART Prefailure Attribute: 1 Raw_Read_Error_Rate changed from 104 to 106
Feb 14 03:54:07 storeman smartd[21882]: Device: /dev/sdbi [SAT], SMART Prefailure Attribute: 1 Raw_Read_Error_Rate changed from 104 to 106
Feb 14 03:54:07 storeman smartd[21882]: Device: /dev/sdbj [SAT], SMART Prefailure Attribute: 1 Raw_Read_Error_Rate changed from 104 to 106
Feb 14 03:54:07 storeman smartd[21882]: Device: /dev/sdbj [SAT], SMART Prefailure Attribute: 1 Raw_Read_Error_Rate changed from 104 to 106
Feb 14 00:54:07 storeman smartd[21882]: Device: /dev/sdaf [SAT], previous self-test completed without error
Feb 14 00:54:07 storeman smartd[21882]: Device: /dev/sdbc [SAT], previous self-test completed without error
Feb 14 00:54:07 storeman smartd[21882]: Device: /dev/sdai [SAT], previous self-test completed without error
Feb 14 00:54:07 storeman smartd[21882]: Device: /dev/sdbe [SAT], previous self-test completed without error
Feb 14 00:54:07 storeman smartd[21882]: Device: /dev/sdq [SAT], previous self-test completed without error
Feb 14 00:54:07 storeman smartd[21882]: Device: /dev/sdw [SAT], previous self-test completed without error
Feb 14 00:54:07 storeman smartd[21882]: Device: /dev/sday [SAT], previous self-test completed without error
Feb 14 00:54:07 storeman smartd[21882]: Device: /dev/sdf [SAT], previous self-test completed without error
Feb 14 00:54:07 storeman smartd[21882]: Device: /dev/sdt [SAT], previous self-test completed without error
Feb 14 00:54:07 storeman smartd[21882]: Device: /dev/sdm [SAT], previous self-test completed without error
Feb 14 00:54:07 storeman smartd[21882]: Device: /dev/sdaj [SAT], previous self-test completed without error
Feb 14 00:54:07 storeman smartd[21882]: Device: /dev/sdae [SAT], previous self-test completed without error
Feb 14 00:54:07 storeman smartd[21882]: Device: /dev/sdab [SAT], previous self-test completed without error
Feb 14 00:54:07 storeman smartd[21882]: Device: /dev/sdav [SAT], previous self-test completed without error
Feb 14 00:54:07 storeman smartd[21882]: Device: /dev/sdat [SAT], previous self-test completed without error
Feb 14 00:54:07 storeman smartd[21882]: Device: /dev/sdaq [SAT], previous self-test completed without error
Feb 14 00:54:07 storeman smartd[21882]: Device: /dev/sdbd [SAT], previous self-test completed without error
Feb 14 00:54:07 storeman smartd[21882]: Device: /dev/sdba [SAT], previous self-test completed without error
Feb 14 00:54:07 storeman smartd[21882]: Device: /dev/sdaw [SAT], previous self-test completed without error
Feb 14 00:54:07 storeman smartd[21882]: Device: /dev/sdu [SAT], previous self-test completed without error
Feb 14 00:54:07 storeman smartd[21882]: Device: /dev/sdak [SAT], previous self-test completed without error
Feb 14 00:54:07 storeman smartd[21882]: Device: /dev/sdbg [SAT], previous self-test completed without error
Feb 14 00:54:07 storeman smartd[21882]: Device: /dev/sdax [SAT], previous self-test completed without error
Feb 14 00:54:07 storeman smartd[21882]: Device: /dev/sdv [SAT], previous self-test completed without error
Feb 14 00:54:07 storeman smartd[21882]: Device: /dev/sdp [SAT], previous self-test completed without error
Feb 14 00:54:07 storeman smartd[21882]: Device: /dev/sdk [SAT], previous self-test completed without error
Feb 14 00:54:07 storeman smartd[21882]: Device: /dev/sdx [SAT], previous self-test completed without error
Feb 14 00:54:07 storeman smartd[21882]: Device: /dev/sdbk [SAT], previous self-test completed without error
Feb 14 00:54:07 storeman smartd[21882]: Device: /dev/sdbl [SAT], previous self-test completed without error
Feb 14 00:54:07 storeman smartd[21882]: Device: /dev/sdr [SAT], previous self-test completed without error
Feb 14 00:54:07 storeman smartd[21882]: Device: /dev/sdi [SAT], previous self-test completed without error
Feb 14 00:54:07 storeman smartd[21882]: Device: /dev/sdb [SAT], previous self-test completed without error
Feb 14 00:54:07 storeman smartd[21882]: Device: /dev/sdap [SAT], previous self-test completed without error
Feb 14 00:54:07 storeman smartd[21882]: Device: /dev/sdaa [SAT], previous self-test completed without error
Feb 14 00:54:07 storeman smartd[21882]: Device: /dev/sdaz [SAT], previous self-test completed without error
Feb 14 00:54:07 storeman smartd[21882]: Device: /dev/sdao [SAT], previous self-test completed without error
Feb 14 00:54:07 storeman smartd[21882]: Device: /dev/sdc [SAT], previous self-test completed without error
Feb 14 00:54:07 storeman smartd[21882]: Device: /dev/sdg [SAT], previous self-test completed without error
Feb 14 00:54:07 storeman smartd[21882]: Device: /dev/sdn [SAT], previous self-test completed without error
Feb 14 00:54:07 storeman smartd[21882]: Device: /dev/sdj [SAT], previous self-test completed without error
Feb 14 00:54:07 storeman smartd[21882]: Device: /dev/sda [SAT], previous self-test completed without error
Feb 14 00:54:07 storeman smartd[21882]: Device: /dev/sdd [SAT], previous self-test completed without error
Feb 14 00:54:07 storeman smartd[21882]: Device: /dev/sde [SAT], previous self-test completed without error
Feb 14 00:54:07 storeman smartd[21882]: Device: /dev/sdo [SAT], previous self-test completed without error
Feb 14 00:54:07 storeman smartd[21882]: Device: /dev/sdh [SAT], previous self-test completed without error
Feb 14 00:54:07 storeman smartd[21882]: Device: /dev/sdam [SAT], previous self-test completed without error
Feb 14 00:54:07 storeman smartd[21882]: Device: /dev/sdz [SAT], previous self-test completed without error
Feb 14 00:54:07 storeman smartd[21882]: Device: /dev/sdan [SAT], previous self-test completed without error
Feb 14 00:54:07 storeman smartd[21882]: Device: /dev/sdas [SAT], previous self-test completed without error
Feb 14 00:54:07 storeman smartd[21882]: Device: /dev/sdar [SAT], previous self-test completed without error
Feb 14 00:54:07 storeman smartd[21882]: Device: /dev/sdl [SAT], previous self-test completed without error
Feb 14 00:54:07 storeman smartd[21882]: Device: /dev/sdy [SAT], previous self-test completed without error
Feb 14 00:54:07 storeman smartd[21882]: Device: /dev/sdad [SAT], previous self-test completed without error
Feb 14 00:54:07 storeman smartd[21882]: Device: /dev/sdbb [SAT], previous self-test completed without error
Feb 14 00:54:07 storeman smartd[21882]: Device: /dev/sdbh [SAT], previous self-test completed without error
Feb 14 00:54:07 storeman smartd[21882]: Device: /dev/sdag [SAT], previous self-test completed without error
Feb 14 00:54:07 storeman smartd[21882]: Device: /dev/sds [SAT], previous self-test completed without error
Feb 14 00:54:07 storeman smartd[21882]: Device: /dev/sdau [SAT], previous self-test completed without error
Feb 14 00:54:07 storeman smartd[21882]: Device: /dev/sdah [SAT], previous self-test completed without error
Feb 14 00:54:07 storeman smartd[21882]: Device: /dev/sdbi [SAT], previous self-test completed without error
Feb 14 00:54:07 storeman smartd[21882]: Device: /dev/sdac [SAT], previous self-test completed without error
Feb 14 00:54:07 storeman smartd[21882]: Device: /dev/sdbj [SAT], previous self-test completed without error
Feb 14 00:54:07 storeman smartd[21882]: Device: /dev/sdal [SAT], previous self-test completed without error
Feb 14 00:54:07 storeman smartd[21882]: Device: /dev/sdbf [SAT], previous self-test completed without error
Feb 13 22:16:15 storeman kernel: sr 24:0:0:0: tag#0 FAILED Result: hostbyte=DID_ERROR driverbyte=DRIVER_OK cmd_age=0s
Feb 13 22:16:15 storeman kernel: sr 23:0:0:0: tag#0 FAILED Result: hostbyte=DID_ERROR driverbyte=DRIVER_OK cmd_age=0s
Feb 13 22:16:15 storeman kernel: sr 23:0:0:0: tag#0 FAILED Result: hostbyte=DID_ERROR driverbyte=DRIVER_OK cmd_age=0s
Feb 13 22:16:15 storeman kernel: sr 26:0:0:0: tag#0 FAILED Result: hostbyte=DID_ERROR driverbyte=DRIVER_OK cmd_age=0s
Feb 13 22:16:14 storeman kernel: sr 26:0:0:0: tag#0 FAILED Result: hostbyte=DID_ERROR driverbyte=DRIVER_OK cmd_age=0s
Feb 13 21:04:16 storeman nginx[22107]: 2023/02/13 21:04:16 [error] 22107#22107: *528 recv() failed (104: Connection reset by peer) while proxying upgraded connection, client: 10.1.0.228, server: localhost, request: "GET /websocket/shell/ HTTP/1.1", upstream: "http://127.0.0.1:6000/_shell/", host: "storeman.octen"
Feb 13 20:45:35 storeman dockerd[26406]: time="2023-02-13T20:45:35.244183105-06:00" level=warning msg="cleanup warnings time=\"2023-02-13T20:45:35-06:00\" level=info msg=\"starting signal loop\" namespace=moby pid=4109014 runtime=io.containerd.runc.v2\ntime=\"2023-02-13T20:45:35-06:00\" level=warning msg=\"failed to remove runc container\" error=\"runc did not terminate successfully: exit status 255: \" runtime=io.containerd.runc.v2\n"
Feb 13 20:39:52 storeman kernel: blk_update_request: I/O error, dev sr1, sector 10567200 op 0x0:(READ) flags 0x0 phys_seg 28 prio class 0
Feb 13 20:39:52 storeman kernel: blk_update_request: I/O error, dev sr1, sector 10566688 op 0x0:(READ) flags 0x0 phys_seg 24 prio class 0
Feb 13 20:29:09 storeman kernel: Buffer I/O error on dev sr1, logical block 1320834, async page read
Feb 13 20:29:09 storeman kernel: blk_update_request: I/O error, dev sr1, sector 10566672 op 0x0:(READ) flags 0x0 phys_seg 1 prio class 0
Feb 13 20:29:09 storeman kernel: blk_update_request: I/O error, dev sr1, sector 10566656 op 0x0:(READ) flags 0x80700 phys_seg 64 prio class 0
Feb 11 03:11:23 storeman wsdd.py[2132892]: OSError: [Errno 98] Address already in use
Feb 11 03:11:23 storeman wsdd.py[2132892]: ERROR: error in main loop
Feb 11 02:56:42 storeman wsdd.py[2076509]: OSError: [Errno 98] Address already in use
Feb 11 02:56:42 storeman wsdd.py[2076509]: ERROR: error in main loop
Feb 10 02:54:07 storeman smartd[21882]: Device: /dev/sdbj [SAT], SMART Prefailure Attribute: 1 Raw_Read_Error_Rate changed from 102 to 104
Feb 10 02:54:07 storeman smartd[21882]: Device: /dev/sdbj [SAT], SMART Prefailure Attribute: 1 Raw_Read_Error_Rate changed from 102 to 104
Feb 07 03:54:07 storeman smartd[21882]: Device: /dev/sdbi [SAT], SMART Usage Attribute: 195 ECC_Uncorr_Error_Count changed from 100 to 120
Feb 07 03:54:07 storeman smartd[21882]: Device: /dev/sdbi [SAT], SMART Prefailure Attribute: 1 Raw_Read_Error_Rate changed from 120 to 104
Feb 07 03:54:07 storeman smartd[21882]: Device: /dev/sdbi [SAT], SMART Usage Attribute: 195 ECC_Uncorr_Error_Count changed from 100 to 120
Feb 07 03:54:07 storeman smartd[21882]: Device: /dev/sdbi [SAT], SMART Prefailure Attribute: 1 Raw_Read_Error_Rate changed from 120 to 104
Feb 07 03:54:07 storeman smartd[21882]: Device: /dev/sdbj [SAT], SMART Usage Attribute: 195 ECC_Uncorr_Error_Count changed from 100 to 120
Feb 07 03:54:07 storeman smartd[21882]: Device: /dev/sdbj [SAT], SMART Prefailure Attribute: 1 Raw_Read_Error_Rate changed from 120 to 102
Feb 07 03:54:07 storeman smartd[21882]: Device: /dev/sdbj [SAT], SMART Usage Attribute: 195 ECC_Uncorr_Error_Count changed from 100 to 120
Feb 07 03:54:07 storeman smartd[21882]: Device: /dev/sdbj [SAT], SMART Prefailure Attribute: 1 Raw_Read_Error_Rate changed from 120 to 102
Feb 07 00:54:08 storeman smartd[21882]: Device: /dev/sdaf [SAT], previous self-test completed without error
Feb 07 00:54:08 storeman smartd[21882]: Device: /dev/sdbc [SAT], previous self-test completed without error
Feb 07 00:54:07 storeman smartd[21882]: Device: /dev/sdai [SAT], previous self-test completed without error
Feb 07 00:54:07 storeman smartd[21882]: Device: /dev/sdbe [SAT], previous self-test completed without error
Feb 07 00:54:07 storeman smartd[21882]: Device: /dev/sdq [SAT], previous self-test completed without error
Feb 07 00:54:07 storeman smartd[21882]: Device: /dev/sdw [SAT], previous self-test completed without error
Feb 07 00:54:07 storeman smartd[21882]: Device: /dev/sday [SAT], previous self-test completed without error
Feb 07 00:54:07 storeman smartd[21882]: Device: /dev/sdf [SAT], previous self-test completed without error
Feb 07 00:54:07 storeman smartd[21882]: Device: /dev/sdt [SAT], previous self-test completed without error
Feb 07 00:54:07 storeman smartd[21882]: Device: /dev/sdm [SAT], previous self-test completed without error
Feb 07 00:54:07 storeman smartd[21882]: Device: /dev/sdaj [SAT], previous self-test completed without error
Feb 07 00:54:07 storeman smartd[21882]: Device: /dev/sdae [SAT], previous self-test completed without error
Feb 07 00:54:07 storeman smartd[21882]: Device: /dev/sdab [SAT], previous self-test completed without error
Feb 07 00:54:07 storeman smartd[21882]: Device: /dev/sdav [SAT], previous self-test completed without error
Feb 07 00:54:07 storeman smartd[21882]: Device: /dev/sdat [SAT], previous self-test completed without error
Feb 07 00:54:07 storeman smartd[21882]: Device: /dev/sdaq [SAT], previous self-test completed without error
Feb 07 00:54:07 storeman smartd[21882]: Device: /dev/sdbd [SAT], previous self-test completed without error
Feb 07 00:54:07 storeman smartd[21882]: Device: /dev/sdba [SAT], previous self-test completed without error
Feb 07 00:54:07 storeman smartd[21882]: Device: /dev/sdaw [SAT], previous self-test completed without error
Feb 07 00:54:07 storeman smartd[21882]: Device: /dev/sdu [SAT], previous self-test completed without error
Feb 07 00:54:07 storeman smartd[21882]: Device: /dev/sdak [SAT], previous self-test completed without error
Feb 07 00:54:07 storeman smartd[21882]: Device: /dev/sdbg [SAT], previous self-test completed without error
Feb 07 00:54:07 storeman smartd[21882]: Device: /dev/sdax [SAT], previous self-test completed without error
Feb 07 00:54:07 storeman smartd[21882]: Device: /dev/sdv [SAT], previous self-test completed without error
Feb 07 00:54:07 storeman smartd[21882]: Device: /dev/sdp [SAT], previous self-test completed without error
Feb 07 00:54:07 storeman smartd[21882]: Device: /dev/sdk [SAT], previous self-test completed without error
Feb 07 00:54:07 storeman smartd[21882]: Device: /dev/sdx [SAT], previous self-test completed without error
Feb 07 00:54:07 storeman smartd[21882]: Device: /dev/sdbk [SAT], previous self-test completed without error
Feb 07 00:54:07 storeman smartd[21882]: Device: /dev/sdbl [SAT], previous self-test completed without error
Feb 07 00:54:07 storeman smartd[21882]: Device: /dev/sdr [SAT], previous self-test completed without error
Feb 07 00:54:07 storeman smartd[21882]: Device: /dev/sdi [SAT], previous self-test completed without error
Feb 07 00:54:07 storeman smartd[21882]: Device: /dev/sdb [SAT], previous self-test completed without error
Feb 07 00:54:07 storeman smartd[21882]: Device: /dev/sdap [SAT], previous self-test completed without error
Feb 07 00:54:07 storeman smartd[21882]: Device: /dev/sdaa [SAT], previous self-test completed without error
Feb 07 00:54:07 storeman smartd[21882]: Device: /dev/sdaz [SAT], previous self-test completed without error
Feb 07 00:54:07 storeman smartd[21882]: Device: /dev/sdao [SAT], previous self-test completed without error
Feb 07 00:54:07 storeman smartd[21882]: Device: /dev/sdc [SAT], previous self-test completed without error
Feb 07 00:54:07 storeman smartd[21882]: Device: /dev/sdg [SAT], previous self-test completed without error
Feb 07 00:54:07 storeman smartd[21882]: Device: /dev/sdn [SAT], previous self-test completed without error
Feb 07 00:54:07 storeman smartd[21882]: Device: /dev/sdj [SAT], previous self-test completed without error
Feb 07 00:54:07 storeman smartd[21882]: Device: /dev/sda [SAT], previous self-test completed without error
Feb 07 00:54:07 storeman smartd[21882]: Device: /dev/sdd [SAT], previous self-test completed without error
Feb 07 00:54:07 storeman smartd[21882]: Device: /dev/sde [SAT], previous self-test completed without error
Feb 07 00:54:07 storeman smartd[21882]: Device: /dev/sdo [SAT], previous self-test completed without error
Feb 07 00:54:07 storeman smartd[21882]: Device: /dev/sdh [SAT], previous self-test completed without error
Feb 07 00:54:07 storeman smartd[21882]: Device: /dev/sdam [SAT], previous self-test completed without error
Feb 07 00:54:07 storeman smartd[21882]: Device: /dev/sdz [SAT], previous self-test completed without error
Feb 07 00:54:07 storeman smartd[21882]: Device: /dev/sdan [SAT], previous self-test completed without error
Feb 07 00:54:07 storeman smartd[21882]: Device: /dev/sdas [SAT], previous self-test completed without error
Feb 07 00:54:07 storeman smartd[21882]: Device: /dev/sdar [SAT], previous self-test completed without error
Feb 07 00:54:07 storeman smartd[21882]: Device: /dev/sdl [SAT], previous self-test completed without error
Feb 07 00:54:07 storeman smartd[21882]: Device: /dev/sdy [SAT], previous self-test completed without error
Feb 07 00:54:07 storeman smartd[21882]: Device: /dev/sdad [SAT], previous self-test completed without error
Feb 07 00:54:07 storeman smartd[21882]: Device: /dev/sdbb [SAT], previous self-test completed without error
Feb 07 00:54:07 storeman smartd[21882]: Device: /dev/sdbh [SAT], previous self-test completed without error
Feb 07 00:54:07 storeman smartd[21882]: Device: /dev/sdag [SAT], previous self-test completed without error
Feb 07 00:54:07 storeman smartd[21882]: Device: /dev/sds [SAT], previous self-test completed without error
Feb 07 00:54:07 storeman smartd[21882]: Device: /dev/sdau [SAT], previous self-test completed without error
Feb 07 00:54:07 storeman smartd[21882]: Device: /dev/sdah [SAT], previous self-test completed without error
Feb 07 00:54:07 storeman smartd[21882]: Device: /dev/sdbi [SAT], previous self-test completed without error
Feb 07 00:54:07 storeman smartd[21882]: Device: /dev/sdac [SAT], previous self-test completed without error
Feb 07 00:54:07 storeman smartd[21882]: Device: /dev/sdbj [SAT], previous self-test completed without error
Feb 07 00:54:07 storeman smartd[21882]: Device: /dev/sdal [SAT], previous self-test completed without error
Feb 07 00:54:07 storeman smartd[21882]: Device: /dev/sdbf [SAT], previous self-test completed without error
Feb 05 03:56:28 storeman systemd-xdg-autostart-generator[2282874]: Not generating service for XDG autostart app-at\x2dspi\x2ddbus\x2dbus-autostart.service, error parsing Exec= line: No such file or directory
Feb 05 00:18:45 storeman kernel: blk_update_request: I/O error, dev sr0, sector 7819116 op 0x0:(READ) flags 0x0 phys_seg 1 prio class 0
Feb 05 00:18:45 storeman kernel: sr 23:0:0:0: [sr0] tag#0 Add. Sense: Unrecovered read error
Feb 05 00:18:45 storeman kernel: sr 23:0:0:0: [sr0] tag#0 Sense Key : Medium Error [deferred]
Feb 05 00:18:10 storeman kernel: blk_update_request: I/O error, dev sr0, sector 7819116 op 0x0:(READ) flags 0x0 phys_seg 1 prio class 0
Feb 05 00:18:10 storeman kernel: sr 23:0:0:0: [sr0] tag#0 Add. Sense: Unrecovered read error
Feb 05 00:18:10 storeman kernel: sr 23:0:0:0: [sr0] tag#0 Sense Key : Medium Error [deferred]
Feb 05 00:17:37 storeman kernel: blk_update_request: I/O error, dev sr0, sector 7819116 op 0x0:(READ) flags 0x0 phys_seg 1 prio class 0
Feb 05 00:17:37 storeman kernel: sr 23:0:0:0: [sr0] tag#0 Add. Sense: Unrecovered read error
Feb 05 00:17:37 storeman kernel: sr 23:0:0:0: [sr0] tag#0 Sense Key : Medium Error [deferred]
Feb 05 00:17:06 storeman kernel: blk_update_request: I/O error, dev sr0, sector 7819116 op 0x0:(READ) flags 0x0 phys_seg 1 prio class 0
Feb 05 00:17:06 storeman kernel: sr 23:0:0:0: [sr0] tag#0 Add. Sense: Unrecovered read error
Feb 05 00:17:06 storeman kernel: sr 23:0:0:0: [sr0] tag#0 Sense Key : Medium Error [deferred]
Feb 05 00:16:33 storeman kernel: blk_update_request: I/O error, dev sr0, sector 7819116 op 0x0:(READ) flags 0x0 phys_seg 1 prio class 0
Feb 05 00:16:33 storeman kernel: sr 23:0:0:0: [sr0] tag#0 Add. Sense: Unrecovered read error
Feb 05 00:16:33 storeman kernel: sr 23:0:0:0: [sr0] tag#0 Sense Key : Medium Error [deferred]
Feb 05 00:15:12 storeman kernel: blk_update_request: I/O error, dev sr0, sector 7819836 op 0x0:(READ) flags 0x0 phys_seg 5 prio class 0
Feb 05 00:15:12 storeman kernel: sr 23:0:0:0: [sr0] tag#0 Add. Sense: Unrecovered read error
Feb 05 00:15:12 storeman kernel: sr 23:0:0:0: [sr0] tag#0 Sense Key : Medium Error [deferred]
Feb 05 00:14:36 storeman kernel: blk_update_request: I/O error, dev sr0, sector 7819596 op 0x0:(READ) flags 0x4000 phys_seg 11 prio class 0
Feb 05 00:14:36 storeman kernel: sr 23:0:0:0: [sr0] tag#0 Add. Sense: Unrecovered read error
Feb 05 00:14:36 storeman kernel: sr 23:0:0:0: [sr0] tag#0 Sense Key : Medium Error [deferred]
Feb 05 00:14:06 storeman kernel: blk_update_request: I/O error, dev sr0, sector 7819356 op 0x0:(READ) flags 0x4000 phys_seg 17 prio class 0
Feb 05 00:14:06 storeman kernel: sr 23:0:0:0: [sr0] tag#0 Add. Sense: Unrecovered read error
Feb 05 00:14:06 storeman kernel: sr 23:0:0:0: [sr0] tag#0 Sense Key : Medium Error [deferred]
Feb 04 23:59:32 storeman kernel: Buffer I/O error on dev sr2, logical block 3226645, async page read
Feb 04 23:59:32 storeman kernel: blk_update_request: I/O error, dev sr2, sector 12906580 op 0x0:(READ) flags 0x0 phys_seg 1 prio class 0
Feb 04 23:59:32 storeman kernel: Buffer I/O error on dev sr2, logical block 3226644, async page read
Feb 04 23:59:32 storeman kernel: blk_update_request: I/O error, dev sr2, sector 12906576 op 0x0:(READ) flags 0x0 phys_seg 1 prio class 0
Feb 04 23:59:31 storeman kernel: blk_update_request: I/O error, dev sr2, sector 12906496 op 0x0:(READ) flags 0x80700 phys_seg 64 prio class 0
Feb 04 23:37:05 storeman kernel: Buffer I/O error on dev sr1, logical block 965120, async page read
Feb 04 23:37:05 storeman kernel: blk_update_request: I/O error, dev sr1, sector 7720960 op 0x0:(READ) flags 0x0 phys_seg 1 prio class 0
Feb 04 23:37:05 storeman kernel: blk_update_request: I/O error, dev sr1, sector 7720960 op 0x0:(READ) flags 0x80700 phys_seg 64 prio class 0
Feb 04 23:23:10 storeman kernel: Buffer I/O error on dev sr2, logical block 1478210, async page read
Feb 04 23:23:10 storeman kernel: blk_update_request: I/O error, dev sr2, sector 11825680 op 0x0:(READ) flags 0x0 phys_seg 1 prio class 0
Feb 04 23:23:10 storeman kernel: blk_update_request: I/O error, dev sr2, sector 11825664 op 0x0:(READ) flags 0x80700 phys_seg 64 prio class 0
Feb 04 23:23:08 storeman kernel: Buffer I/O error on dev sr1, logical block 1055362, async page read
Feb 04 23:23:08 storeman kernel: blk_update_request: I/O error, dev sr1, sector 8442896 op 0x0:(READ) flags 0x0 phys_seg 1 prio class 0
Feb 04 23:23:07 storeman kernel: blk_update_request: I/O error, dev sr1, sector 8442880 op 0x0:(READ) flags 0x80700 phys_seg 64 prio class 0
Feb 04 23:23:06 storeman kernel: Buffer I/O error on dev sr1, logical block 1024, async page read
Feb 04 23:23:06 storeman kernel: blk_update_request: I/O error, dev sr1, sector 8192 op 0x0:(READ) flags 0x0 phys_seg 1 prio class 0
Feb 04 23:23:06 storeman kernel: blk_update_request: I/O error, dev sr1, sector 8192 op 0x0:(READ) flags 0x80700 phys_seg 1 prio class 0
Feb 04 23:07:37 storeman kernel: Buffer I/O error on dev sr0, logical block 1107520, async page read
Feb 04 23:07:37 storeman kernel: blk_update_request: I/O error, dev sr0, sector 8860160 op 0x0:(READ) flags 0x0 phys_seg 1 prio class 0
Feb 04 23:07:37 storeman kernel: blk_update_request: I/O error, dev sr0, sector 8860160 op 0x0:(READ) flags 0x80700 phys_seg 30 prio class 0
Feb 04 23:07:18 storeman kernel: Buffer I/O error on dev sr0, logical block 1024, async page read
Feb 04 23:07:18 storeman kernel: blk_update_request: I/O error, dev sr0, sector 8192 op 0x0:(READ) flags 0x0 phys_seg 1 prio class 0
Feb 04 23:07:18 storeman kernel: blk_update_request: I/O error, dev sr0, sector 8192 op 0x0:(READ) flags 0x80700 phys_seg 1 prio class 0
Feb 04 23:01:57 storeman kernel: Buffer I/O error on dev sr2, logical block 843648, async page read
Feb 04 23:01:57 storeman kernel: blk_update_request: I/O error, dev sr2, sector 6749184 op 0x0:(READ) flags 0x0 phys_seg 1 prio class 0
Feb 04 23:01:57 storeman kernel: blk_update_request: I/O error, dev sr2, sector 6749184 op 0x0:(READ) flags 0x80700 phys_seg 60 prio class 0
Feb 04 23:01:56 storeman kernel: Buffer I/O error on dev sr2, logical block 256, async page read
Feb 04 23:01:56 storeman kernel: blk_update_request: I/O error, dev sr2, sector 2048 op 0x0:(READ) flags 0x0 phys_seg 1 prio class 0
Feb 04 23:01:56 storeman kernel: blk_update_request: I/O error, dev sr2, sector 2048 op 0x0:(READ) flags 0x80700 phys_seg 1 prio class 0
Feb 04 22:36:51 storeman kernel: Buffer I/O error on dev sr2, logical block 1069184, async page read
Feb 04 22:36:51 storeman kernel: blk_update_request: I/O error, dev sr2, sector 8553472 op 0x0:(READ) flags 0x0 phys_seg 1 prio class 0
Feb 04 22:36:51 storeman kernel: blk_update_request: I/O error, dev sr2, sector 8553472 op 0x0:(READ) flags 0x80700 phys_seg 62 prio class 0
Feb 04 22:29:49 storeman ntpd[22012]: kernel reports TIME_ERROR: 0x41: Clock Unsynchronized
Feb 04 22:25:33 storeman wsdd.py[26231]: OSError: [Errno 98] Address already in use
Feb 04 22:25:33 storeman wsdd.py[26231]: ERROR: error in main loop
Feb 04 22:25:00 storeman dockerd[26348]: time="2023-02-04T22:25:00.655005028-06:00" level=error msg="Unable to determine real path of /dev/sr3 for validation"
Feb 04 22:24:23 storeman dockerd[26348]: time="2023-02-04T22:24:23.564744246-06:00" level=error msg="Unable to determine real path of /var/lib/kubelet/pods/93844450-1911-48a8-ae94-bffe1185202d/volumes/kubernetes.io~empty-dir/tailscale-manifests-temp for validation"
Feb 04 22:24:23 storeman dockerd[26348]: time="2023-02-04T22:24:23.550296992-06:00" level=error msg="Unable to determine real path of /var/lib/kubelet/pods/551b1a84-b3f3-4275-89bd-379b0f5bd854/containers/zerotier-manifests/e50e6679 for validation"
Feb 04 22:24:23 storeman dockerd[26348]: time="2023-02-04T22:24:23.550279182-06:00" level=error msg="Unable to determine real path of /var/lib/kubelet/pods/551b1a84-b3f3-4275-89bd-379b0f5bd854/etc-hosts for validation"
Feb 04 22:24:23 storeman dockerd[26348]: time="2023-02-04T22:24:23.550199092-06:00" level=error msg="Unable to determine real path of /var/lib/kubelet/pods/551b1a84-b3f3-4275-89bd-379b0f5bd854/volumes/kubernetes.io~empty-dir/zerotier-manifests-temp for validation"
Feb 04 22:24:23 storeman dockerd[26406]: time="2023-02-04T22:24:23.352062294-06:00" level=error msg="failed to initialize a tracing processor \"otlp\"" error="no OpenTelemetry endpoint: skip plugin"
Feb 04 22:24:23 storeman dockerd[26406]: time="2023-02-04T22:24:23.351961884-06:00" level=info msg="skip loading plugin \"io.containerd.tracing.processor.v1.otlp\"..." error="no OpenTelemetry endpoint: skip plugin" type=io.containerd.tracing.processor.v1
Feb 04 22:24:23 storeman dockerd[26406]: time="2023-02-04T22:24:23.349013223-06:00" level=warning msg="could not use snapshotter devmapper in metadata plugin" error="devmapper not configured"
Feb 04 22:24:23 storeman dockerd[26406]: time="2023-02-04T22:24:23.328291476-06:00" level=warning msg="failed to load plugin io.containerd.snapshotter.v1.devmapper" error="devmapper not configured"
Feb 04 22:24:23 storeman dockerd[26406]: time="2023-02-04T22:24:23.328254236-06:00" level=info msg="skip loading plugin \"io.containerd.snapshotter.v1.btrfs\"..." error="path /mnt/TrueNAS-Apps/ix-applications/docker/containerd/daemon/io.containerd.snapshotter.v1.btrfs (zfs) must be a btrfs filesystem to be used with the btrfs snapshotter: skip plugin" type=io.containerd.snapshotter.v1
Feb 04 22:24:23 storeman dockerd[26406]: time="2023-02-04T22:24:23.327351426-06:00" level=info msg="skip loading plugin \"io.containerd.snapshotter.v1.aufs\"..." error="aufs is not supported (modprobe aufs failed: exit status 1 \"modprobe: FATAL: Module aufs not found in directory /lib/modules/5.15.79+truenas\\n\"): skip plugin" type=io.containerd.snapshotter.v1
Feb 04 22:24:06 storeman smartd[21882]: Device: /dev/sdbi [SAT], SMART Usage Attribute: 195 ECC_Uncorr_Error_Count changed from 120 to 100
Feb 04 22:24:06 storeman smartd[21882]: Device: /dev/sdbi [SAT], SMART Prefailure Attribute: 1 Raw_Read_Error_Rate changed from 105 to 120
Feb 04 22:24:06 storeman smartd[21882]: Device: /dev/sdbi [SAT], SMART Usage Attribute: 195 ECC_Uncorr_Error_Count changed from 120 to 100
Feb 04 22:24:06 storeman smartd[21882]: Device: /dev/sdbi [SAT], SMART Prefailure Attribute: 1 Raw_Read_Error_Rate changed from 105 to 120
Feb 04 22:24:06 storeman smartd[21882]: Device: /dev/sdbj [SAT], SMART Usage Attribute: 195 ECC_Uncorr_Error_Count changed from 120 to 100
Feb 04 22:24:06 storeman smartd[21882]: Device: /dev/sdbj [SAT], SMART Prefailure Attribute: 1 Raw_Read_Error_Rate changed from 104 to 120
Feb 04 22:24:06 storeman smartd[21882]: Device: /dev/sdbj [SAT], SMART Usage Attribute: 195 ECC_Uncorr_Error_Count changed from 120 to 100
Feb 04 22:24:06 storeman smartd[21882]: Device: /dev/sdbj [SAT], SMART Prefailure Attribute: 1 Raw_Read_Error_Rate changed from 104 to 120
Feb 04 22:24:06 storeman syslog-ng[21940]: [2023-02-04T22:24:06.031152] Current position not matches to the saved cursor position, seek to head; cursor='s=e593f3055c7345a2b8440589dcda714c;i=1c86;b=40a922ca176b4d1cbdb32d5f00a0c69d;m=94d1333;t=5f3ec3523c798;x=29b452f3f03991d3', error='Success (0)'
Feb 04 22:24:06 storeman smartd[21882]: Device: /dev/sdbi [SAT], no SMART Error Log, ignoring -l error (override with -T permissive)
Feb 04 22:24:05 storeman smartd[21882]: Device: /dev/sdbi [SAT], no SMART Error Log, ignoring -l error (override with -T permissive)
Feb 04 22:24:05 storeman smartd[21882]: Device: /dev/sdbj [SAT], no SMART Error Log, ignoring -l error (override with -T permissive)
Feb 04 22:24:05 storeman ntpd[22012]: kernel reports TIME_ERROR: 0x41: Clock Unsynchronized
Feb 04 22:24:05 storeman ntpd[22012]: kernel reports TIME_ERROR: 0x41: Clock Unsynchronized
Feb 04 22:24:05 storeman smartd[21882]: Device: /dev/sdbj [SAT], no SMART Error Log, ignoring -l error (override with -T permissive)
Feb 04 22:23:19 storeman kernel: Error: Driver 'pcspkr' is already registered, aborting...
Feb 04 22:23:19 storeman kernel: Buffer I/O error on dev sr1, logical block 512, async page read
Feb 04 22:23:19 storeman kernel: blk_update_request: I/O error, dev sr1, sector 4096 op 0x0:(READ) flags 0x0 phys_seg 1 prio class 0
Feb 04 22:23:19 storeman kernel: Buffer I/O error on dev sr1, logical block 2044890, async page read
Feb 04 22:23:19 storeman kernel: blk_update_request: I/O error, dev sr1, sector 16359120 op 0x0:(READ) flags 0x0 phys_seg 1 prio class 0
Feb 04 22:23:19 storeman kernel: blk_update_request: I/O error, dev sr1, sector 16358912 op 0x0:(READ) flags 0x80700 phys_seg 5 prio class 0
Feb 04 22:23:18 storeman kernel: Buffer I/O error on dev sr1, logical block 512, async page read
Feb 04 22:23:18 storeman kernel: buffer_io_error: 969 callbacks suppressed
Feb 04 22:23:18 storeman kernel: blk_update_request: I/O error, dev sr1, sector 4096 op 0x0:(READ) flags 0x0 phys_seg 1 prio class 0
Feb 04 22:23:18 storeman kernel: blk_update_request: I/O error, dev sr1, sector 4096 op 0x0:(READ) flags 0x80700 phys_seg 1 prio class 0
Feb 04 22:23:18 storeman kernel: print_req_error: 458 callbacks suppressed
Feb 04 22:23:17 storeman kernel: blk_update_request: I/O error, dev sr2, sector 0 op 0x0:(READ) flags 0x0 phys_seg 1 prio class 0
Feb 04 22:23:17 storeman kernel: blk_update_request: critical target error, dev sr2, sector 0 op 0x0:(READ) flags 0x80700 phys_seg 1 prio class 0
Feb 04 22:23:17 storeman kernel: Buffer I/O error on dev sr2, logical block 2097142, async page read
Feb 04 22:23:17 storeman kernel: Buffer I/O error on dev sr2, logical block 2097141, async page read
Feb 04 22:23:17 storeman kernel: Buffer I/O error on dev sr2, logical block 2097140, async page read
Feb 04 22:23:17 storeman kernel: Buffer I/O error on dev sr2, logical block 2097139, async page read
Feb 04 22:23:17 storeman kernel: Buffer I/O error on dev sr2, logical block 2097138, async page read
Feb 04 22:23:17 storeman kernel: Buffer I/O error on dev sr2, logical block 2097137, async page read
Feb 04 22:23:17 storeman kernel: blk_update_request: I/O error, dev sr2, sector 2097137 op 0x0:(READ) flags 0x0 phys_seg 7 prio class 0
Feb 04 22:23:17 storeman kernel: Buffer I/O error on dev sr2, logical block 2097136, async page read
Feb 04 22:23:17 storeman kernel: blk_update_request: I/O error, dev sr2, sector 2097136 op 0x0:(READ) flags 0x0 phys_seg 1 prio class 0
Feb 04 22:23:17 storeman kernel: blk_update_request: critical target error, dev sr2, sector 2097136 op 0x0:(READ) flags 0x80700 phys_seg 1 prio class 0
Feb 04 22:23:17 storeman kernel: Buffer I/O error on dev sr1, logical block 512, async page read
Feb 04 22:23:17 storeman kernel: blk_update_request: I/O error, dev sr1, sector 4096 op 0x0:(READ) flags 0x0 phys_seg 1 prio class 0
Feb 04 22:23:17 storeman kernel: Buffer I/O error on dev sr1, logical block 2044890, async page read
Feb 04 22:23:17 storeman kernel: blk_update_request: I/O error, dev sr1, sector 16359120 op 0x0:(READ) flags 0x0 phys_seg 1 prio class 0
Feb 04 22:23:17 storeman kernel: blk_update_request: I/O error, dev sr1, sector 16358912 op 0x0:(READ) flags 0x80700 phys_seg 59 prio class 0
Feb 04 22:23:17 storeman kernel: Buffer I/O error on dev sr1, logical block 512, async page read
Feb 04 22:23:17 storeman kernel: blk_update_request: I/O error, dev sr1, sector 4096 op 0x0:(READ) flags 0x0 phys_seg 1 prio class 0
Feb 04 22:23:17 storeman kernel: blk_update_request: I/O error, dev sr1, sector 4096 op 0x0:(READ) flags 0x80700 phys_seg 1 prio class 0
Feb 04 22:23:17 storeman kernel: usb 5-2.1.2.4: device not accepting address 9, error -71
Feb 04 22:23:17 storeman kernel: usb 5-2.1.2.4: device not accepting address 8, error -71
Feb 04 22:23:17 storeman kernel: usb 5-2.1.2.4: device descriptor read/64, error -71
Feb 04 22:23:17 storeman kernel: usb 5-2.1.2.4: device descriptor read/64, error -71
Feb 04 22:23:17 storeman kernel: usb 5-2.1.2.4: device descriptor read/64, error -71
Feb 04 22:23:17 storeman kernel: usb 5-2.1.2.4: device descriptor read/64, error -71