Return to Level1Techs.com

Sekiro crashes on launch

linux
#1

I’m fairly new to Linux and trying to just learn more. I’m trying to get Sekiro working on Ubuntu 18.04 and launching the game native through Steam Proton results in a small black window launching for a few seconds and then immediately crashing. Tried some of the tweaks mentioned on the protondb site with no luck and the same result. Launching through the terminal I see a few errors, unsure exactly what they mean, right when the game launches but then it crashes just like before. I tried running it through Lutris under the Wine Steam runner and it crashes on launch with no window pop up or anything. Again I see more errors when launching Lutris through the terminal, but not sure really what they mean. I’ll post the terminal in the replies below. Thanks in advance for anyone that helps, or has any ideas I appreciate it.

OS: Ubuntu 18.04.2 LTS
KERNEL: 5.0.5-050005-generic
CPU: AMD FX-6300 Six-Core
GPU: AMD R9-270x
GPU DRIVER: 4.5 Mesa 19.1.0-devel - padoka PPA
RAM: 16 GB

0 Likes

#2

$ steam steam://run/814380
Running Steam on ubuntu 18.04 64-bit
STEAM_RUNTIME is enabled automatically
Pins up-to-date!
Installing breakpad exception handler for appid(steam)/version(1550534751)
Installing breakpad exception handler for appid(steam)/version(1550534751)
Gtk-Message: 10:48:05.862: Failed to load module “gail”
Gtk-Message: 10:48:05.862: Failed to load module “atk-bridge”

(steam:1122): Gtk-WARNING **: 10:48:05.867: Unable to locate theme engine in module_path: “adwaita”,

(steam:1122): Gtk-WARNING **: 10:48:05.868: Unable to locate theme engine in module_path: “adwaita”,
/usr/share/themes/Arc-Dark/gtk-2.0/main.rc:1090: error: unexpected identifier ‘direction’, expected character ‘}’
/usr/share/themes/Arc-Dark/gtk-2.0/apps.rc:91: error: unexpected identifier ‘direction’, expected character ‘}’
Installing breakpad exception handler for appid(steam)/version(1550534751)
[0417/104806.280293:INFO:crash_reporting.cc(242)] Crash reporting enabled for process: browser
[0417/104806.311176:WARNING:crash_reporting.cc(281)] Failed to set crash key: UserID with value: 0
[0417/104806.311264:WARNING:crash_reporting.cc(281)] Failed to set crash key: BuildID with value: 1550527787
[0417/104806.311270:WARNING:crash_reporting.cc(281)] Failed to set crash key: SteamUniverse with value: Public
[0417/104806.311275:WARNING:crash_reporting.cc(281)] Failed to set crash key: Vendor with value: Valve
[0417/104806.316860:ERROR:gpu_process_transport_factory.cc(1026)] Lost UI shared context.
Installing breakpad exception handler for appid(steam)/version(1550534751)
Installing breakpad exception handler for appid(steam)/version(1550534751)
Installing breakpad exception handler for appid(steam)/version(1550534751)
Installing breakpad exception handler for appid(steam)/version(1550534751)
Installing breakpad exception handler for appid(steam)/version(1550534751)
Installing breakpad exception handler for appid(steam)/version(1550534751)
CApplicationManagerPopulateThread took 2 milliseconds to initialize (will have waited on CAppInfoCacheReadFromDiskThread)
Installing breakpad exception handler for appid(steam)/version(1550534751)
Installing breakpad exception handler for appid(steam)/version(1550534751)
Installing breakpad exception handler for appid(steam)/version(1550534751)
Installing breakpad exception handler for appid(steam)/version(1550534751)
Installing breakpad exception handler for appid(steam)/version(1550534751)
Installing breakpad exception handler for appid(steam)/version(1550534751)
Installing breakpad exception handler for appid(steam)/version(1550534751)
Installing breakpad exception handler for appid(steam)/version(1550534751)
Installing breakpad exception handler for appid(steam)/version(1550534751)
CAppInfoCacheReadFromDiskThread took 62 milliseconds to initialize

** (steam:1122): WARNING **: 10:48:06.495: Unknown device type 14

** (steam:1122): WARNING **: 10:48:06.495: Could not create object for /org/freedesktop/NetworkManager/Devices/1: unknown object type
Installing breakpad exception handler for appid(steam)/version(1550534751)
Opted-in Controller Mask for AppId 0: 0

** (steam:1122): WARNING **: 10:48:06.611: Ignoring invalid property ‘autoconnect-priority’

** (steam:1122): WARNING **: 10:48:06.611: Unknown setting ‘proxy’

** (steam:1122): WARNING **: 10:48:06.611: Ignoring invalid property ‘route-data’

** (steam:1122): WARNING **: 10:48:06.611: Ignoring invalid property ‘address-data’

** (steam:1122): WARNING **: 10:48:06.611: Ignoring invalid property ‘route-data’

** (steam:1122): WARNING **: 10:48:06.611: Ignoring invalid property ‘address-data’
Local Device Found
type: 0e6f 0213
path: sdl://0
serial_number: - 0
Manufacturer:
Product: Afterglow
Release: 100
Interface: -1

!! Steam controller device opened for index 0.
Steam Controller reserving XInput slot 0
Installing breakpad exception handler for appid(steam)/version(1550534751)

(steam:1122): Gtk-WARNING **: 10:48:07.037: gtk_disable_setlocale() must be called before gtk_init()
Installing breakpad exception handler for appid(steam)/version(1550534751)
Controller 0 connected, configuring it now…
Controller has an Invalid or missing unit serial number, setting to ‘e6f-213-c3cfd6d’
Installing breakpad exception handler for appid(steam)/version(1550534751)
Controller device closed after hid_read failure
!! Controller 0 attributes:
Type: 31
ProductID: 531
Serial: e6f-213-c3cfd6d
Capabilities: 001843ff
Firmware Version: 0
Firmware Build Time: 2147483647 (Tue, 19 Jan 2038 03:14:07 GMT)
Bootloader Build Time: 2147483647 (Tue, 19 Jan 2038 03:14:07 GMT)
Could not load local selection (), local override (/home/caleb/.local/share/Steam//controller_config/bigpicture.vdf), or user path (/home/caleb/.local/share/Steam/userdata/205323629/config/controller_configs/bigpicture.vdf), checking last resort path: /home/caleb/.local/share/Steam//controller_base/bigpicture.vdf
Loaded Config for Last Resort Path for App ID 413090: /home/caleb/.local/share/Steam//controller_base/bigpicture.vdf
[413090]Non-Steam Controller Configs Enabled: 1
Could not load local selection (), local override (/home/caleb/.local/share/Steam//controller_config/bigpicture.vdf), or user path (/home/caleb/.local/share/Steam/userdata/205323629/config/controller_configs/bigpicture.vdf), checking last resort path: /home/caleb/.local/share/Steam//controller_base/bigpicture.vdf
Loaded Config for Last Resort Path for App ID 413090: /home/caleb/.local/share/Steam//controller_base/bigpicture.vdf
Loaded Config for Local Override Path for App ID 413080: /home/caleb/.local/share/Steam//controller_base/empty.vdf
[413080]Non-Steam Controller Configs Enabled: 1
Controller 0 disconnected
Fatal : VkResult is “ERROR_INITIALIZATION_FAILED” in /home/pgriffais/src/Vulkan/base/vulkanexamplebase.cpp at line 823
vulkandriverquery: /home/pgriffais/src/Vulkan/base/vulkanexamplebase.cpp:823: void VulkanExampleBase::initVulkan(): Assertion `res == VK_SUCCESS’ failed.
Installing breakpad exception handler for appid(steam)/version(1550534751)
Local Device Found
type: 0e6f 0213
path: sdl://0
serial_number: - 0
Manufacturer:
Product: Afterglow
Release: 100
Interface: -1

!! Steam controller device opened for index 0.
Steam Controller reserving XInput slot 0
Aborted (core dumped)
roaming config store loaded successfully - 4902 bytes.
migrating temporary roaming config store
Controller 0 connected, configuring it now…
Controller has an Invalid or missing unit serial number, setting to ‘e6f-213-c3cfd6d’
[0417/104808.143117:INFO:crash_reporting.cc(265)] Crash reporting enabled for process: renderer
[0417/104808.172961:WARNING:crash_reporting.cc(281)] Failed to set crash key: UserID with value: 0
[0417/104808.173096:WARNING:crash_reporting.cc(281)] Failed to set crash key: BuildID with value: 1550527787
[0417/104808.173103:WARNING:crash_reporting.cc(281)] Failed to set crash key: SteamUniverse with value: Public
[0417/104808.173109:WARNING:crash_reporting.cc(281)] Failed to set crash key: Vendor with value: Valve
[0417/104808.173735:INFO:crash_reporting.cc(242)] Crash reporting enabled for process: gpu-process
Failed to init SteamVR because it isn’t installed
BYieldingQueryAccountsRegisteredToController
ExecCommandLine: “’/home/caleb/.local/share/Steam/ubuntu12_32/steam’ ‘steam://run/814380’”
ExecuteSteamURL: “steam://run/814380”
System startup time: 3.04 seconds
Opted-in Controller Mask for AppId 413080: 0
!! Controller 0 attributes:
Type: 31
ProductID: 531
Serial: e6f-213-c3cfd6d
Capabilities: 001843ff
Firmware Version: 0
Firmware Build Time: 2147483647 (Tue, 19 Jan 2038 03:14:07 GMT)
Bootloader Build Time: 2147483647 (Tue, 19 Jan 2038 03:14:07 GMT)
Loaded Config for Local Selection Path for App ID 413090: /home/caleb/.local/share/Steam/steamapps/workshop/content/241100/1689651975/1007024772344596662_legacy.bin
[413090]Non-Steam Controller Configs Enabled: 1
Loaded Config for Local Selection Path for App ID 413090: /home/caleb/.local/share/Steam/steamapps/workshop/content/241100/1557882944/956347096063782645_legacy.bin
Loaded Config for Local Override Path for App ID 413080: /home/caleb/.local/share/Steam//controller_base/empty.vdf
[413080]Non-Steam Controller Configs Enabled: 1
[0417/104808.731480:INFO:crash_reporting.cc(265)] Crash reporting enabled for process: renderer
Opted-in Controller Mask for AppId 814380: d
Loaded Config for Local Selection Path for App ID 814380: /home/caleb/.local/share/Steam/steamapps/workshop/content/241100/1668826331/994637970746554033_legacy.bin
[814380]Non-Steam Controller Configs Enabled: 1
Loaded Config for Local Override Path for App ID 814380: /home/caleb/.local/share/Steam//controller_base/empty.vdf
GameAction [AppID 814380, ActionID 1] : LaunchApp changed task to ProcessingInstallScript with “”
Proton: Missing or invalid openvrpaths.vrpath file! [Errno 2] No such file or directory: ‘/home/caleb/.config/openvr/openvrpaths.vrpath’
JS method call WebChat.GetWebChatLanguage with 1 arguments
JS method call WebChat.RegisterForFriendPostMessage with 1 arguments
JS method call WebChat.RegisterOverlayChatBrowserInfoChanged with 1 arguments
JS method call WebChat.GetSignIntoFriendsOnStart with 1 arguments
JS method call WebChat.GetCurrentUserAccountID with 1 arguments
JS method call WebChat.RegisterForFriendPostMessage with 1 arguments
JS method call WebChat.GetWebChatURL with 1 arguments
Proton: Missing or invalid openvrpaths.vrpath file! [Errno 2] No such file or directory: ‘/home/caleb/.config/openvr/openvrpaths.vrpath’
Proton: Missing or invalid openvrpaths.vrpath file! [Errno 2] No such file or directory: ‘/home/caleb/.config/openvr/openvrpaths.vrpath’
JS method call FriendSettings.RegisterForSettingsChanges with 1 arguments
JS method call WebChat.RegisterForPushToTalkStateChange with 1 arguments
JS method call WebChat.SetVoiceChatActive with 1 arguments
JS method call WebChat.RegisterForComputerActiveStateChange with 1 arguments
JS method call WebChat.RegisterForFriendPostMessage with 1 arguments
JS method call SharedConnection.AllocateSharedConnection with 1 arguments
JS method call WebChat.RegisterOverlayChatBrowserInfoChanged with 1 arguments
JS method call FriendSettings.GetEnabledFeatures with 1 arguments
JS method call SharedConnection.SubscribeToEMsg with 2 arguments
JS method call SharedConnection.SubscribeToEMsg with 2 arguments
JS method call SharedConnection.SubscribeToEMsg with 2 arguments
JS method call SharedConnection.SubscribeToEMsg with 2 arguments
JS method call SharedConnection.SubscribeToEMsg with 2 arguments
JS method call SharedConnection.SubscribeToEMsg with 2 arguments
JS method call SharedConnection.SubscribeToEMsg with 2 arguments
JS method call SharedConnection.SubscribeToEMsg with 2 arguments
JS method call SharedConnection.SubscribeToClientServiceMethod with 2 arguments
JS method call SharedConnection.SubscribeToClientServiceMethod with 2 arguments
JS method call SharedConnection.SubscribeToClientServiceMethod with 2 arguments
JS method call SharedConnection.SubscribeToClientServiceMethod with 2 arguments
JS method call SharedConnection.SubscribeToClientServiceMethod with 2 arguments
JS method call SharedConnection.SubscribeToClientServiceMethod with 2 arguments
JS method call SharedConnection.SubscribeToClientServiceMethod with 2 arguments
JS method call SharedConnection.SubscribeToClientServiceMethod with 2 arguments
JS method call SharedConnection.SubscribeToClientServiceMethod with 2 arguments
JS method call SharedConnection.SubscribeToClientServiceMethod with 2 arguments
JS method call SharedConnection.SubscribeToClientServiceMethod with 2 arguments
JS method call SharedConnection.SubscribeToClientServiceMethod with 2 arguments
JS method call SharedConnection.SubscribeToClientServiceMethod with 2 arguments
JS method call SharedConnection.SubscribeToClientServiceMethod with 2 arguments
JS method call SharedConnection.SubscribeToClientServiceMethod with 2 arguments
JS method call SharedConnection.SubscribeToClientServiceMethod with 2 arguments
JS method call SharedConnection.SubscribeToClientServiceMethod with 2 arguments
JS method call SharedConnection.SubscribeToClientServiceMethod with 2 arguments
JS method call SharedConnection.SubscribeToClientServiceMethod with 2 arguments
JS method call SharedConnection.SubscribeToClientServiceMethod with 2 arguments
JS method call SharedConnection.SubscribeToClientServiceMethod with 2 arguments
JS method call SharedConnection.SubscribeToClientServiceMethod with 2 arguments
JS method call SharedConnection.SubscribeToClientServiceMethod with 2 arguments
JS method call SharedConnection.SubscribeToClientServiceMethod with 2 arguments
JS method call SharedConnection.SubscribeToClientServiceMethod with 2 arguments
JS method call SharedConnection.SubscribeToClientServiceMethod with 2 arguments
JS method call SharedConnection.SubscribeToClientServiceMethod with 2 arguments
JS method call SharedConnection.RegisterOnLogonInfoChanged with 2 arguments
JS method call SharedConnection.SendMsgAndAwaitResponse with 3 arguments
JS method call Storage.GetString with 2 arguments
JS method call SharedConnection.SendMsgAndAwaitResponse with 3 arguments
JS method call Storage.GetString with 2 arguments
JS method call Storage.GetString with 2 arguments
JS method call Storage.GetString with 2 arguments
JS method call Storage.GetString with 2 arguments
JS method call Storage.GetString with 2 arguments
JS method call SharedConnection.SendMsgAndAwaitResponse with 3 arguments
JS method call SharedConnection.SendMsgAndAwaitResponse with 3 arguments
JS method call WebChat.GetOverlayChatBrowserInfo with 1 arguments
JS method call Parental.RegisterForParentalSettingsChanges with 1 arguments
JS method call Broadcast.RegisterForBroadcastStatus with 1 arguments
JS method call Broadcast.RegisterForViewerRequests with 1 arguments
JS method call SharedConnection.SendMsgAndAwaitResponse with 3 arguments
JS method call SharedConnection.RegisterOnMessageReceived with 2 arguments
JS method call SharedConnection.SendMsg with 2 arguments
JS method call WebChat.GetPushToTalkEnabled with 1 arguments
JS method call SharedConnection.SendMsgAndAwaitResponse with 3 arguments
JS method call SharedConnection.SendMsgAndAwaitResponse with 3 arguments
JS method call Storage.GetString with 2 arguments
JS method call Storage.GetString with 2 arguments
JS method call SharedConnection.SendMsgAndAwaitResponse with 3 arguments
JS method call SharedConnection.SendMsgAndAwaitResponse with 3 arguments
JS method call SharedConnection.SendMsg with 2 arguments
JS method call SharedConnection.SendMsgAndAwaitResponse with 3 arguments
JS method call SharedConnection.SendMsgAndAwaitResponse with 3 arguments
JS method call SharedConnection.SendMsg with 2 arguments
JS method call WebChat.SetNumChatsWithUnreadPriorityMessages with 1 arguments
Proton: Missing or invalid openvrpaths.vrpath file! [Errno 2] No such file or directory: ‘/home/caleb/.config/openvr/openvrpaths.vrpath’
JS method call Storage.GetString with 2 arguments
JS method call WebChat.BSuppressPopupsInRestore with 1 arguments
Proton: Missing or invalid openvrpaths.vrpath file! [Errno 2] No such file or directory: ‘/home/caleb/.config/openvr/openvrpaths.vrpath’
Proton: Missing or invalid openvrpaths.vrpath file! [Errno 2] No such file or directory: ‘/home/caleb/.config/openvr/openvrpaths.vrpath’
GameAction [AppID 814380, ActionID 1] : LaunchApp changed task to SynchronizingCloud with “”
GameAction [AppID 814380, ActionID 1] : LaunchApp changed task to SiteLicenseSeatCheckout with “”
GameAction [AppID 814380, ActionID 1] : LaunchApp changed task to CreatingProcess with “”
GameAction [AppID 814380, ActionID 1] : LaunchApp waiting for user response to CreatingProcess “”
GameAction [AppID 814380, ActionID 1] : LaunchApp continues with user response “CreatingProcess”
Game update: AppID 814380 “”, ProcID 1540, IP 0.0.0.0:0
Loaded Config for Local Selection Path for App ID 814380: /home/caleb/.local/share/Steam/steamapps/workshop/content/241100/1668826331/994637970746554033_legacy.bin
Loaded Config for Local Override Path for App ID 814380: /home/caleb/.local/share/Steam//controller_base/empty.vdf

Adding process 1540 for game ID 814380
GameAction [AppID 814380, ActionID 1] : LaunchApp changed task to WaitingGameWindow with “”
GameAction [AppID 814380, ActionID 1] : LaunchApp changed task to Completed with “”
ERROR: ld.so: object ‘/home/caleb/.local/share/Steam/ubuntu12_32/gameoverlayrenderer.so’ from LD_PRELOAD cannot be preloaded (wrong ELF class: ELFCLASS32): ignored.
ERROR: ld.so: object ‘/home/caleb/.local/share/Steam/ubuntu12_32/gameoverlayrenderer.so’ from LD_PRELOAD cannot be preloaded (wrong ELF class: ELFCLASS32): ignored.

Adding process 1545 for game ID 814380
ERROR: ld.so: object ‘/home/caleb/.local/share/Steam/ubuntu12_32/gameoverlayrenderer.so’ from LD_PRELOAD cannot be preloaded (wrong ELF class: ELFCLASS32): ignored.

Adding process 1546 for game ID 814380
Proton: Missing or invalid openvrpaths.vrpath file! [Errno 2] No such file or directory: ‘/home/caleb/.config/openvr/openvrpaths.vrpath’
ERROR: ld.so: object ‘/home/caleb/.local/share/Steam/ubuntu12_32/gameoverlayrenderer.so’ from LD_PRELOAD cannot be preloaded (wrong ELF class: ELFCLASS32): ignored.
ERROR: ld.so: object ‘/home/caleb/.local/share/Steam/ubuntu12_64/gameoverlayrenderer.so’ from LD_PRELOAD cannot be preloaded (wrong ELF class: ELFCLASS64): ignored.
ERROR: ld.so: object ‘/home/caleb/.local/share/Steam/ubuntu12_64/gameoverlayrenderer.so’ from LD_PRELOAD cannot be preloaded (wrong ELF class: ELFCLASS64): ignored.

Adding process 1547 for game ID 814380
ERROR: ld.so: object ‘/home/caleb/.local/share/Steam/ubuntu12_32/gameoverlayrenderer.so’ from LD_PRELOAD cannot be preloaded (wrong ELF class: ELFCLASS32): ignored.

Adding process 1548 for game ID 814380
ERROR: ld.so: object ‘/home/caleb/.local/share/Steam/ubuntu12_32/gameoverlayrenderer.so’ from LD_PRELOAD cannot be preloaded (wrong ELF class: ELFCLASS32): ignored.

Adding process 1550 for game ID 814380
Adding process 1553 for game ID 814380
JS method call SharedConnection.SendMsgAndAwaitResponse with 3 arguments
ERROR: ld.so: object ‘/home/caleb/.local/share/Steam/ubuntu12_32/gameoverlayrenderer.so’ from LD_PRELOAD cannot be preloaded (wrong ELF class: ELFCLASS32): ignored.

Adding process 1555 for game ID 814380
ERROR: ld.so: object ‘/home/caleb/.local/share/Steam/ubuntu12_32/gameoverlayrenderer.so’ from LD_PRELOAD cannot be preloaded (wrong ELF class: ELFCLASS32): ignored.

Adding process 1558 for game ID 814380
ERROR: ld.so: object ‘/home/caleb/.local/share/Steam/ubuntu12_32/gameoverlayrenderer.so’ from LD_PRELOAD cannot be preloaded (wrong ELF class: ELFCLASS32): ignored.
ERROR: ld.so: object ‘/home/caleb/.local/share/Steam/ubuntu12_32/gameoverlayrenderer.so’ from LD_PRELOAD cannot be preloaded (wrong ELF class: ELFCLASS32): ignored.

Adding process 1567 for game ID 814380
Adding process 1572 for game ID 814380
ERROR: ld.so: object ‘/home/caleb/.local/share/Steam/ubuntu12_32/gameoverlayrenderer.so’ from LD_PRELOAD cannot be preloaded (wrong ELF class: ELFCLASS32): ignored.
Game update: AppID 814380 “”, ProcID 1548, IP 0.0.0.0:0
Setting breakpad minidump AppID = 814380
Steam_SetMinidumpSteamID: Caching Steam ID: 76561198165589357 [API loaded no]
ERROR: ld.so: object ‘/home/caleb/.local/share/Steam/ubuntu12_32/gameoverlayrenderer.so’ from LD_PRELOAD cannot be preloaded (wrong ELF class: ELFCLASS32): ignored.

Adding process 1587 for game ID 814380
Adding process 1589 for game ID 814380
Game update: AppID 814380 “”, ProcID 1589, IP 0.0.0.0:0
Game update: AppID 814380 “”, ProcID 1589, IP 0.0.0.0:0
wine: Unhandled page fault on read access to 0x00000110 at address 0x140f3d161 (thread 0029), starting debugger…
ERROR: ld.so: object ‘/home/caleb/.local/share/Steam/ubuntu12_32/gameoverlayrenderer.so’ from LD_PRELOAD cannot be preloaded (wrong ELF class: ELFCLASS32): ignored.

Adding process 1634 for game ID 814380
0050:fixme:dbghelp:elf_search_auxv can’t find symbol in module
0050:fixme:dbghelp:elf_search_auxv can’t find symbol in module
0050:fixme:dbghelp:elf_search_auxv can’t find symbol in module
0050:fixme:dbghelp:elf_search_auxv can’t find symbol in module
0050:fixme:dbghelp:elf_search_auxv can’t find symbol in module
0050:fixme:dbghelp:elf_search_auxv can’t find symbol in module
0050:fixme:dbghelp:elf_search_auxv can’t find symbol in module
0050:fixme:dbghelp:elf_search_auxv can’t find symbol in module
0050:fixme:dbghelp:elf_search_auxv can’t find symbol in module
0050:fixme:dbghelp:elf_search_auxv can’t find symbol in module
0050:fixme:dbghelp:elf_search_auxv can’t find symbol in module
0050:fixme:dbghelp:elf_search_auxv can’t find symbol in module
0050:fixme:dbghelp:elf_search_auxv can’t find symbol in module
0050:fixme:dbghelp:elf_search_auxv can’t find symbol in module
0050:fixme:dbghelp:elf_search_auxv can’t find symbol in module
0050:fixme:dbghelp:elf_search_auxv can’t find symbol in module
0050:fixme:dbghelp:elf_search_auxv can’t find symbol in module
0050:fixme:dbghelp:elf_search_auxv can’t find symbol in module
0050:fixme:dbghelp:elf_search_auxv can’t find symbol in module
0050:fixme:dbghelp:elf_search_auxv can’t find symbol in module
0050:fixme:dbghelp:elf_search_auxv can’t find symbol in module
0050:fixme:dbghelp:elf_search_auxv can’t find symbol in module
0050:fixme:dbghelp:elf_search_auxv can’t find symbol in module
0050:fixme:dbghelp:elf_search_auxv can’t find symbol in module
0050:fixme:dbghelp:elf_search_auxv can’t find symbol in module
0050:fixme:dbghelp:elf_search_auxv can’t find symbol in module
0050:fixme:dbghelp:elf_search_auxv can’t find symbol in module
0050:fixme:dbghelp:elf_search_auxv can’t find symbol in module
0050:fixme:dbghelp:elf_search_auxv can’t find symbol in module
0050:fixme:dbghelp:elf_search_auxv can’t find symbol in module
0050:fixme:dbghelp:elf_search_auxv can’t find symbol in module
0050:fixme:dbghelp:elf_search_auxv can’t find symbol in module
0050:fixme:dbghelp:elf_search_auxv can’t find symbol in module
0050:fixme:dbghelp:elf_search_auxv can’t find symbol in module
0050:fixme:dbghelp:elf_search_auxv can’t find symbol in module
0050:fixme:dbghelp:elf_search_auxv can’t find symbol in module
0050:fixme:dbghelp:elf_search_auxv can’t find symbol in module
0050:fixme:dbghelp:elf_search_auxv can’t find symbol in module
0050:fixme:dbghelp:elf_search_auxv can’t find symbol in module
0050:fixme:dbghelp:elf_search_auxv can’t find symbol in module
0050:fixme:dbghelp:elf_search_auxv can’t find symbol in module
0050:fixme:dbghelp:elf_search_auxv can’t find symbol in module
0050:fixme:dbghelp:elf_search_auxv can’t find symbol in module
0050:fixme:dbghelp:elf_search_auxv can’t find symbol in module
0050:fixme:dbghelp:elf_search_auxv can’t find symbol in module
0050:fixme:dbghelp:elf_search_auxv can’t find symbol in module
0050:fixme:dbghelp:elf_search_auxv can’t find symbol in module
0050:fixme:dbghelp:elf_search_auxv can’t find symbol in module
0050:fixme:dbghelp:elf_search_auxv can’t find symbol in module
0050:fixme:dbghelp:elf_search_auxv can’t find symbol in module
0050:fixme:dbghelp:elf_search_auxv can’t find symbol in module
0050:fixme:dbghelp:elf_search_auxv can’t find symbol in module
0050:fixme:dbghelp:elf_search_auxv can’t find symbol in module
0050:fixme:dbghelp:elf_search_auxv can’t find symbol in module
0050:fixme:dbghelp:elf_search_auxv can’t find symbol in module
Unhandled exception: page fault on read access to 0x00000110 in 64-bit code (0x0000000140f3d161).
0050:fixme:dbghelp:elf_search_auxv can’t find symbol in module
0050:fixme:dbghelp:interpret_function_table_entry PUSH_MACHFRAME 6
0050:fixme:dbghelp:interpret_function_table_entry PUSH_MACHFRAME 6
Register dump:
rip:0000000140f3d161 rsp:000000000022f5f0 rbp:000000000022f6f0 eflags:00010202 ( R- – I - - - )
rax:00007f4d042bfcb0 rbx:0000000000000006 rcx:00007f4d04337c30 rdx:0000000000000000
rsi:00007f4d64275bd0 rdi:0000000000000000 r8:0000000000000c78 r9:0000000000000000 r10:000000005fca7700
r11:00007f4d043388e0 r12:0000000000000000 r13:00007f4d63ff1960 r14:0000000000000000 r15:00007f4d6404b420
Stack dump:
0x000000000022f5f0: 0000000000000006 0000000000000006
0x000000000022f600: 00007f4d03ffc040 00007f4d04320f60
0x000000000022f610: 0000000900000010 0000000000000020
0x000000000022f620: fffffffffffffffe 00000001419b18ee
0x000000000022f630: 00000001439173e8 0000000143917888
0x000000000022f640: 00000001439173e8 00000001439173e8
0x000000000022f650: 00000001439173e8 00000001439173e8
0x000000000022f660: 000001c200000320 0000002000000001
0x000000000022f670: 0000000300000002 0000000000000000
0x000000000022f680: 0000000000000000 0000000143910000
0x000000000022f690: 0000000000010058 0000000900000010
0x000000000022f6a0: 000000000022f701 0000000000000000
Backtrace:
=>0 0x0000000140f3d161 EntryPoint+0xfced1e51() in sekiro (0x000000000022f6f0)
1 0x0000000140f4075e EntryPoint+0xfced544d() in sekiro (0x00000001430ecac0)
2 0x0000000140f3f5f4 EntryPoint+0xfced42e3() in sekiro (0x00000001430ecac0)
3 0x0000000140f3f4c5 EntryPoint+0xfced41b4() in sekiro (0x000000000022fb20)
4 0x0000000142544835 EntryPoint+0xfe4d9524() in sekiro (0x000000000022fb20)
5 0x0000000142544b30 EntryPoint+0xfe4d981f() in sekiro (0x000000000022fb20)
6 0x00000001424f6862 EntryPoint+0xfe48b551() in sekiro (0x0000000000000060)
7 0x00000001424c555e EntryPoint+0xfe45a24d() in sekiro (0x0000000000000000)
8 0x000000014114aead EntryPoint+0xfd0dfb9c() in sekiro (0x0000000000000000)
9 0x0000000143916ea8 EntryPoint+0xff8abb97() in sekiro (0x0000000141199a36)
0x0000000140f3d161 EntryPoint+0xfced1e51 in sekiro: movl 0x0000000000000110(%rdx),%ecx
Modules:
Module Address Debug info Name (178 modules)
PE 230000- 40e000 Deferred fmodex64
PE 410000- 49f000 Deferred fmod_event64
PE 4a0000- 5ae000 Deferred oo2core_6_win64
PE 5b0000- 614000 Deferred bink2w64
PE 620000- 666000 Deferred d3dx11_43
PE 670000- 8df000 Deferred d3dcompiler_43
PE 2590000- 2624000 Deferred openvr_api_dxvk
PE 3b400000- 3b421000 Deferred steam_api64
PE 6a340000- 6a583000 Deferred d3d11
PE 6f200000- 6f380000 Deferred dxgi
ELF 7a800000- 7aa09000 Deferred opengl32
-PE 7a850000- 7aa09000 \ opengl32
ELF 7b400000- 7b825000 Deferred kernel32
-PE 7b420000- 7b825000 \ kernel32
ELF 7bc00000- 7bd42000 Deferred ntdll
-PE 7bc20000- 7bd42000 \ ntdll
ELF 7c000000- 7c003000 Deferred
PE 140000000- 144097000 Export sekiro
PE 180000000- 180020000 Deferred amd_ags_x64
ELF 7f4d003a0000- 7f4d03fdb000 Deferred libllvm-9.so.1
ELF 7f4dc8890000- 7f4dc8aa5000 Deferred libgpg-error.so.0
ELF 7f4dc8aa8000- 7f4dc8d51000 Deferred libvorbisenc.so.2
ELF 7f4dc8d58000- 7f4dc8f83000 Deferred libvorbis.so.0
ELF 7f4dc8f88000- 7f4dc9191000 Deferred libogg.so.0
ELF 7f4dc9198000- 7f4dc940f000 Deferred libflac.so.8
ELF 7f4dc9410000- 7f4dc972b000 Deferred libgcrypt.so.20
ELF 7f4dc9730000- 7f4dc995a000 Deferred libtinfo.so.5
ELF 7f4dc9960000- 7f4dc9b97000 Deferred libedit.so.2
ELF 7f4dc9d18000- 7f4dc9f34000 Deferred liblz4.so.1
ELF 7f4dc9f38000- 7f4dca15e000 Deferred liblzma.so.5
ELF 7f4dca160000- 7f4dca366000 Deferred libasyncns.so.0
ELF 7f4dca368000- 7f4dca5e1000 Deferred libsndfile.so.1
ELF 7f4dca5e8000- 7f4dca7f2000 Deferred libwrap.so.0
ELF 7f4dca7f8000- 7f4dcaa7c000 Deferred libsystemd.so.0
ELF 7f4dcaa80000- 7f4dcaccd000 Deferred libdbus-1.so.3
ELF 7f4dcacd0000- 7f4dcaf4e000 Deferred libpulsecommon-11.1.so
ELF 7f4dcaf50000- 7f4dcb1a0000 Deferred libpulse.so.0
ELF 7f4dcb1a0000- 7f4dcb1cd000 Deferred winepulse
-PE 7f4dcb1b0000- 7f4dcb1cd000 \ winepulse
ELF 7f4dcb1d0000- 7f4dcb1f7000 Deferred mmdevapi
-PE 7f4dcb1e0000- 7f4dcb1f7000 \ mmdevapi
ELF 7f4dcb200000- 7f4dcb215000 Deferred api-ms-win-core-sysinfo-l1-2-1
-PE 7f4dcb210000- 7f4dcb215000 \ api-ms-win-core-sysinfo-l1-2-1
ELF 7f4dcb3e0000- 7f4dcb608000 Deferred libpng12.so.0
ELF 7f4dcb608000- 7f4dcb61d000 Deferred api-ms-win-appmodel-runtime-l1-1-1
-PE 7f4dcb610000- 7f4dcb61d000 \ api-ms-win-appmodel-runtime-l1-1-1
ELF 7f4dcb620000- 7f4dcb634000 Deferred api-ms-win-core-string-l1-1-0
-PE 7f4dcb630000- 7f4dcb634000 \ api-ms-win-core-string-l1-1-0
ELF 7f4dcb648000- 7f4dcd170000 Deferred steamclient.so
ELF 7f4dcd170000- 7f4dcd490000 Deferred lsteamclient
-PE 7f4dcd270000- 7f4dcd490000 \ lsteamclient
ELF 7f4dcd490000- 7f4dcd4ce000 Deferred uxtheme
-PE 7f4dcd4a0000- 7f4dcd4ce000 \ uxtheme
ELF 7f4dcd4d0000- 7f4dcd4e5000 Deferred api-ms-win-core-localization-l1-2-1
-PE 7f4dcd4e0000- 7f4dcd4e5000 \ api-ms-win-core-localization-l1-2-1
ELF 7f4dcd4e8000- 7f4dcd4fc000 Deferred api-ms-win-core-fibers-l1-1-1
-PE 7f4dcd4f0000- 7f4dcd4fc000 \ api-ms-win-core-fibers-l1-1-1
ELF 7f4dcd500000- 7f4dcd515000 Deferred api-ms-win-core-synch-l1-2-0
-PE 7f4dcd510000- 7f4dcd515000 \ api-ms-win-core-synch-l1-2-0
ELF 7f4dcd518000- 7f4dcd767000 Deferred libvulkan.so.1
ELF 7f4dcd770000- 7f4dcd976000 Deferred libxfixes.so.3
ELF 7f4dcd978000- 7f4dcdb82000 Deferred libxcursor.so.1
ELF 7f4dcdb88000- 7f4dcdd92000 Deferred libxrender.so.1
ELF 7f4dcdd98000- 7f4dcdfa8000 Deferred libxi.so.6
ELF 7f4dcdfa8000- 7f4dce1ab000 Deferred libxcomposite.so.1
ELF 7f4dce1b0000- 7f4dce3b6000 Deferred libxxf86vm.so.1
ELF 7f4dce3b8000- 7f4dce5bb000 Deferred libxinerama.so.1
ELF 7f4dce5c0000- 7f4dce7d2000 Deferred libxext.so.6
ELF 7f4dce7d8000- 7f4dce882000 Deferred winex11
-PE 7f4dce7f0000- 7f4dce882000 \ winex11
ELF 7f4dcea48000- 7f4dcec7a000 Deferred libexpat.so.1
ELF 7f4dcec80000- 7f4dceec5000 Deferred libfontconfig.so.1
ELF 7f4dceec8000- 7f4dcf0fa000 Deferred libpng16.so.16
ELF 7f4dcf100000- 7f4dcf3b4000 Deferred libfreetype.so.6
ELF 7f4dcf3b8000- 7f4dcf406000 Deferred usp10
-PE 7f4dcf3c0000- 7f4dcf406000 \ usp10
ELF 7f4dcf408000- 7f4dcf561000 Deferred comctl32
-PE 7f4dcf410000- 7f4dcf561000 \ comctl32
ELF 7f4dcf568000- 7f4dcf8a3000 Deferred libsdl2-2.0.so.0
ELF 7f4dcf8a8000- 7f4dcf90c000 Deferred dinput8
-PE 7f4dcf8b0000- 7f4dcf90c000 \ dinput8
ELF 7f4dcf910000- 7f4dcf929000 Deferred xinput1_3
-PE 7f4dcf920000- 7f4dcf929000 \ xinput1_3
ELF 7f4dcf930000- 7f4dcfaa9000 Deferred wined3d
-PE 7f4dcf950000- 7f4dcfaa9000 \ wined3d
ELF 7f4dcfab0000- 7f4dcfb04000 Deferred d3d9
-PE 7f4dcfac0000- 7f4dcfb04000 \ d3d9
ELF 7f4dcfb08000- 7f4dcfb32000 Deferred imm32
-PE 7f4dcfb10000- 7f4dcfb32000 \ imm32
ELF 7f4dcfb38000- 7f4dcfcac000 Deferred oleaut32
-PE 7f4dcfb60000- 7f4dcfcac000 \ oleaut32
ELF 7f4dcfcb0000- 7f4dcfcd6000 Deferred bcrypt
-PE 7f4dcfcc0000- 7f4dcfcd6000 \ bcrypt
ELF 7f4dcfcd8000- 7f4dcfdc6000 Deferred crypt32
-PE 7f4dcfcf0000- 7f4dcfdc6000 \ crypt32
ELF 7f4dcfdc8000- 7f4dcffd0000 Deferred libffi.so.6
ELF 7f4dcffd0000- 7f4dd0208000 Deferred libcrypt.so.1
ELF 7f4dd0208000- 7f4dd0511000 Deferred libsqlite3.so.0
ELF 7f4dd0518000- 7f4dd0762000 Deferred libhx509.so.5
ELF 7f4dd0768000- 7f4dd0977000 Deferred libheimbase.so.1
ELF 7f4dd0978000- 7f4dd0ba1000 Deferred libwind.so.0
ELF 7f4dd0ba8000- 7f4dd0e29000 Deferred libgmp.so.10
ELF 7f4dd0e30000- 7f4dd1064000 Deferred libhogweed.so.4
ELF 7f4dd1068000- 7f4dd129e000 Deferred libnettle.so.6
ELF 7f4dd12a0000- 7f4dd14b3000 Deferred libtasn1.so.6
ELF 7f4dd14b8000- 7f4dd1836000 Deferred libunistring.so.2
ELF 7f4dd1838000- 7f4dd1a55000 Deferred libidn2.so.0
ELF 7f4dd1a58000- 7f4dd1d87000 Deferred libp11-kit.so.0
ELF 7f4dd1d88000- 7f4dd1fa5000 Deferred libz.so.1
ELF 7f4dd1fa8000- 7f4dd21be000 Deferred libroken.so.18
ELF 7f4dd21c0000- 7f4dd23f6000 Deferred libhcrypto.so.4
ELF 7f4dd23f8000- 7f4dd25fc000 Deferred libcom_err.so.2
ELF 7f4dd2600000- 7f4dd28a2000 Deferred libasn1.so.8
ELF 7f4dd28a8000- 7f4dd2b35000 Deferred libkrb5.so.26
ELF 7f4dd2b38000- 7f4dd2d41000 Deferred libheimntlm.so.0
ELF 7f4dd2d48000- 7f4dd30ad000 Deferred libgnutls.so.30
ELF 7f4dd30b0000- 7f4dd32f1000 Deferred libgssapi.so.3
ELF 7f4dd32f8000- 7f4dd3513000 Deferred libsasl2.so.2
ELF 7f4dd3518000- 7f4dd3733000 Deferred libresolv.so.2
ELF 7f4dd3738000- 7f4dd3946000 Deferred liblber-2.4.so.2
ELF 7f4dd3948000- 7f4dd3b9a000 Deferred libldap_r-2.4.so.2
ELF 7f4dd3ba0000- 7f4dd3c0a000 Deferred wldap32
-PE 7f4dd3bb0000- 7f4dd3c0a000 \ wldap32
ELF 7f4dd3c10000- 7f4dd3c3e000 Deferred msacm32
-PE 7f4dd3c20000- 7f4dd3c3e000 \ msacm32
ELF 7f4dd3c40000- 7f4dd3d06000 Deferred winmm
-PE 7f4dd3c50000- 7f4dd3d06000 \ winmm
ELF 7f4dd3d08000- 7f4dd3d39000 Deferred iphlpapi
-PE 7f4dd3d10000- 7f4dd3d39000 \ iphlpapi
ELF 7f4dd3d40000- 7f4dd3d5d000 Deferred wsock32
-PE 7f4dd3d50000- 7f4dd3d5d000 \ wsock32
ELF 7f4dd3d60000- 7f4dd3d9f000 Deferred ws2_32
-PE 7f4dd3d70000- 7f4dd3d9f000 \ ws2_32
ELF 7f4dd3da0000- 7f4dd3e79000 Deferred msvcrt
-PE 7f4dd3dc0000- 7f4dd3e79000 \ msvcrt
ELF 7f4dd3e80000- 7f4dd3ed1000 Deferred winevulkan
-PE 7f4dd3e90000- 7f4dd3ed1000 \ winevulkan
ELF 7f4dd3ed8000- 7f4dd3ef1000 Deferred vulkan-1
-PE 7f4dd3ee0000- 7f4dd3ef1000 \ vulkan-1
ELF 7f4dd3ef8000- 7f4dd3f97000 Deferred rpcrt4
-PE 7f4dd3f10000- 7f4dd3f97000 \ rpcrt4
ELF 7f4dd3f98000- 7f4dd413d000 Deferred ole32
-PE 7f4dd3fc0000- 7f4dd413d000 \ ole32
ELF 7f4dd4140000- 7f4dd4169000 Deferred shcore
-PE 7f4dd4150000- 7f4dd4169000 \ shcore
ELF 7f4dd4170000- 7f4dd418b000 Deferred version
-PE 7f4dd4180000- 7f4dd418b000 \ version
ELF 7f4dd4190000- 7f4dd4310000 Deferred gdi32
-PE 7f4dd41b0000- 7f4dd4310000 \ gdi32
ELF 7f4dd4310000- 7f4dd4574000 Deferred user32
-PE 7f4dd4330000- 7f4dd4574000 \ user32
ELF 7f4dd4578000- 7f4dd4600000 Deferred shlwapi
-PE 7f4dd4590000- 7f4dd4600000 \ shlwapi
ELF 7f4dd4600000- 7f4dd500c000 Deferred shell32
-PE 7f4dd4620000- 7f4dd500c000 \ shell32
ELF 7f4dd5110000- 7f4dd51a1000 Deferred advapi32
-PE 7f4dd5120000- 7f4dd51a1000 \ advapi32
ELF 7f4dd5c78000- 7f4dd5e8a000 Deferred libnss_files.so.2
ELF 7f4dd5e90000- 7f4dd60aa000 Deferred libnsl.so.1
ELF 7f4dd60b0000- 7f4dd62bc000 Deferred libnss_nis.so.2
ELF 7f4dd62c0000- 7f4dd64ca000 Deferred libnss_compat.so.2
ELF 7f4dd7bc8000- 7f4dd7ddd000 Deferred libbsd.so.0
ELF 7f4dd7de0000- 7f4dd7fe6000 Deferred libxdmcp.so.6
ELF 7f4dd7fe8000- 7f4dd81ec000 Deferred libxau.so.6
ELF 7f4dd81f0000- 7f4dd8418000 Deferred libxcb.so.1
ELF 7f4dd8418000- 7f4dd8750000 Deferred libx11.so.6
ELF 7f4dd8750000- 7f4dd8968000 Deferred libgcc_s.so.1
ELF 7f4dd8968000- 7f4dd8c1e000 Deferred libgldispatch.so.0
ELF 7f4dd8c20000- 7f4dd8e51000 Deferred libglx.so.0
ELF 7f4dd8e58000- 7f4dd91f6000 Deferred libm.so.6
ELF 7f4dd9588000- 7f4dd978c000 Deferred libdl.so.2
ELF 7f4dd9790000- 7f4dd9998000 Deferred librt.so.1
ELF 7f4dd9998000- 7f4dd9c24000 Deferred libgl.so.1
ELF 7f4dd9c28000- 7f4dda019000 Deferred libc.so.6
ELF 7f4dda020000- 7f4dda23f000 Deferred libpthread.so.0
ELF 7f4dda240000- 7f4dda5eb000 Export libwine.so.1
ELF 7f4dda5f0000- 7f4dda82b000 Deferred gameoverlayrenderer.so
ELF 7f4dda830000- 7f4ddaa5a000 Deferred ld-linux-x86-64.so.2
Threads:
process tid prio (all id:s are in hex)
00000008 steam.exe
00000025 0
00000009 0
0000000c services.exe
00000022 0
0000001f 0
0000001a 0
00000016 0
00000013 0
00000012 0
00000011 0
0000000e 0
0000000d 0
0000000f winedevice.exe
00000017 0
00000015 0
00000014 0
00000010 0
00000018 plugplay.exe
0000001c 0
0000001b 0
00000019 0
0000001d winedevice.exe
00000024 0
00000023 0
00000021 0
00000020 0
0000001e 0
00000026 explorer.exe
0000002c 0
0000002b 0
0000002a 0
00000027 0
00000028 (D) Z:\home\caleb.local\share\Steam\steamapps\common\Sekiro\sekiro.exe
0000004e 0
0000004d 2
0000004c 0
0000004b 2
0000004a 0
00000049 15
00000048 0
00000047 0
00000046 1
00000045 -15
00000044 0
00000043 0
00000042 0
00000041 0
00000040 0
0000003f 0
0000003e 0
0000003d -1
0000003c 1
0000003b 1
0000003a 1
00000039 1
00000038 1
00000037 1
00000036 1
00000035 1
00000034 -2
00000033 1
00000032 1
00000031 1
00000030 1
0000002f 1
0000002e 0
00000029 0 <==
System information:
Wine build: wine-4.2
Platform: x86_64
Version: Windows 7
Host system: Linux
Host version: 5.0.8-050008-generic
pid 1551 != 1550, skipping destruction (fork without exec?)
Game removed: AppID 814380 “”, ProcID 1589
Install

0 Likes

#3
~$ lutris

2019-04-17 10:50:46,368: Running Lutris 0.5.2
2019-04-17 10:50:46,369: Using X.Org
2019-04-17 10:50:46,369: Running Mesa driver 19.1.0 on AMD PITCAIRN (DRM 2.50.0, 5.0.8-050008-generic, LLVM 9.0.0) (0x6810)
2019-04-17 10:50:46,369: GPU: 1002:6810 1043:0464 using radeon drivers
2019-04-17 10:50:46,396: Vulkan is not available or your system isn’t Vulkan capable
2019-04-17 10:50:46,397: Updating DXVK versions
2019-04-17 10:50:46,568: Connected to lutris.net as thekinsman
2019-04-17 10:50:56,484: Replacing /home/caleb/.local/share/lutris/runners/winesteam/prefix64/drive_c/Program Files (x86)/Steam/steamapps/common/Sekiro/prefix/drive_c/windows/system32/dxgi with DXVK version
2019-04-17 10:50:56,484: Replacing /home/caleb/.local/share/lutris/runners/winesteam/prefix64/drive_c/Program Files (x86)/Steam/steamapps/common/Sekiro/prefix/drive_c/windows/system32/d3d11 with DXVK version
2019-04-17 10:50:56,484: Replacing /home/caleb/.local/share/lutris/runners/winesteam/prefix64/drive_c/Program Files (x86)/Steam/steamapps/common/Sekiro/prefix/drive_c/windows/system32/d3d10core with DXVK version
2019-04-17 10:50:56,484: Replacing /home/caleb/.local/share/lutris/runners/winesteam/prefix64/drive_c/Program Files (x86)/Steam/steamapps/common/Sekiro/prefix/drive_c/windows/system32/d3d10_1 with DXVK version
2019-04-17 10:50:56,485: Replacing /home/caleb/.local/share/lutris/runners/winesteam/prefix64/drive_c/Program Files (x86)/Steam/steamapps/common/Sekiro/prefix/drive_c/windows/system32/d3d10 with DXVK version
2019-04-17 10:50:56,485: Replacing /home/caleb/.local/share/lutris/runners/winesteam/prefix64/drive_c/Program Files (x86)/Steam/steamapps/common/Sekiro/prefix/drive_c/windows/system32/d3d9 with DXVK version
2019-04-17 10:50:56,485: Replacing /home/caleb/.local/share/lutris/runners/winesteam/prefix64/drive_c/Program Files (x86)/Steam/steamapps/common/Sekiro/prefix/drive_c/windows/syswow64/dxgi with DXVK version
2019-04-17 10:50:56,485: Replacing /home/caleb/.local/share/lutris/runners/winesteam/prefix64/drive_c/Program Files (x86)/Steam/steamapps/common/Sekiro/prefix/drive_c/windows/syswow64/d3d11 with DXVK version
2019-04-17 10:50:56,485: Replacing /home/caleb/.local/share/lutris/runners/winesteam/prefix64/drive_c/Program Files (x86)/Steam/steamapps/common/Sekiro/prefix/drive_c/windows/syswow64/d3d10core with DXVK version
2019-04-17 10:50:56,486: Replacing /home/caleb/.local/share/lutris/runners/winesteam/prefix64/drive_c/Program Files (x86)/Steam/steamapps/common/Sekiro/prefix/drive_c/windows/syswow64/d3d10_1 with DXVK version
2019-04-17 10:50:56,486: Replacing /home/caleb/.local/share/lutris/runners/winesteam/prefix64/drive_c/Program Files (x86)/Steam/steamapps/common/Sekiro/prefix/drive_c/windows/syswow64/d3d10 with DXVK version
2019-04-17 10:50:56,486: Replacing /home/caleb/.local/share/lutris/runners/winesteam/prefix64/drive_c/Program Files (x86)/Steam/steamapps/common/Sekiro/prefix/drive_c/windows/syswow64/d3d9 with DXVK version
Running /home/caleb/.local/share/lutris/runners/wine/tkg-protonified-4.4-x86_64/bin/wine /home/caleb/.local/share/lutris/runners/winesteam/prefix64/drive_c/Program Files (x86)/Steam/Steam.exe -no-cef-sandbox -console steam://rungameid/814380
S:\Program Files (x86)\Steam\bin\cef\cef.win7x64\steamwebhelper.exe: invalid option – `-n’
Try ‘steamwebhelper.exe --help’ for more information.
System page size: 4096
Could not find page for trampoline in +/- 2GB range of function to hook
Error allocating trampoline memory (no memory within +/-2gb? prior failures?)
[0417/105058.997:ERROR:registration_protocol_win.cc(84)] TransactNamedPipe: Broken pipe. (0x6D)
[0417/105058.999:INFO:crash_reporting.cc(242)] Crash reporting enabled for process: browser
[0417/105059.081:ERROR:network_change_notifier_win.cc(157)] WSALookupServiceBegin failed with: 8
[0417/105059.503:ERROR:registration_protocol_win.cc(56)] CreateFile: File not found. (0x2)
[0417/105059.504:INFO:crash_reporting.cc(242)] Crash reporting enabled for process: gpu-process
info: Game: steamwebhelper.exe
info: DXVK: v1.0.3
warn: OpenVR: Failed to locate module
info: Enabled instance extensions:
info: VK_KHR_get_physical_device_properties2
info: VK_KHR_surface
info: VK_KHR_win32_surface
err: DxvkInstance::createInstance: Failed to create Vulkan instance
err: D3D11CreateDevice: Failed to create a DXGI factory
[0417/105059.570:ERROR:gl_surface_egl.cc(863)] eglInitialize D3D11 failed with error EGL_NOT_INITIALIZED, trying next display type
wine: Unhandled page fault on read access to 0x7f16b8001fe0 at address 0x7f16c98a3554 (thread 005f), starting debugger…
Unhandled exception: page fault on read access to 0x7f16b8001fe0 in 64-bit code (0x00007f16c98a3554).
Register dump:
rip:00007f16c98a3554 rsp:000000000024e960 rbp:00007f16780196c0 eflags:00010206 ( R- – I - -P- )
rax:00007f16b8001fe0 rbx:0000000004a0002c rcx:000000000000006f rdx:00007f1678001d60
rsi:0000000004a0002c rdi:00007f1678017480 r8:0000000000000000 r9:000000000024e970 r10:0000000000000082
r11:0000000000000000 r12:00007f1678000b20 r13:00000000ffffffff r14:0000000000000000 r15:000000000691c390
Stack dump:
0x000000000024e960: 00000000000400d6 00000000000ef150
0x000000000024e970: 0000000000000000 00000000000ef150
0x000000000024e980: 00000000000d34d0 00007f16c9e2bb4e
0x000000000024e990: 00000000000400d6 000000000024eaa0
0x000000000024e9a0: 00000000000ef150 00007f16c9e2d84a
0x000000000024e9b0: 0000000000000000 5e9cdbca63fd4900
0x000000000024e9c0: 702d676b742f656e 0000000000000000
0x000000000024e9d0: 0000000000000000 0000000000000000
0x000000000024e9e0: 0000000000000000 702d676b742f656e
0x000000000024e9f0: 6966696e6f746f72 00007f16ce87c420
0x000000000024ea00: 00007f16ce87c420 0000000000000000
0x000000000024ea10: 0000000000000000 0000000000000000
Backtrace:
=>0 0x00007f16c98a3554 (0x00007f16780196c0)
0x00007f16c98a3554: movq (%rax),%rdi
Modules:
Module Address Debug info Name (75 modules)
PE 250000- 65f9000 Deferred libcef
PE 6600000- 66a5000 Deferred chrome_elf
PE 83c0000- 87ee000 Deferred d3dcompiler_47
PE 87f0000- 8ca3000 Deferred libglesv2
PE 8cb0000- 8cd1000 Deferred libegl
PE 6a340000- 6a57f000 Deferred d3d11
PE 6f200000- 6f37e000 Deferred dxgi
PE 7a850000- 7a858000 Deferred opengl32
PE 7b420000- 7b5e0000 Deferred kernel32
PE 7bc20000- 7bc33000 Deferred ntdll
PE 140000000- 14066d000 Deferred steamwebhelper
PE 180000000- 18010b000 Deferred sdl2
PE 7f16c3490000- 7f16c3495000 Deferred mfplat
PE 7f16c34e0000- 7f16c34e5000 Deferred mf
PE 7f16c3510000- 7f16c3516000 Deferred cfgmgr32
PE 7f16c3530000- 7f16c3534000 Deferred api-ms-win-core-file-l2-1-1
PE 7f16c39c0000- 7f16c39c4000 Deferred api-ms-win-core-localization-obsolete-l1-2-0
PE 7f16c39e0000- 7f16c39e4000 Deferred api-ms-win-core-datetime-l1-1-1
PE 7f16c39f0000- 7f16c39f4000 Deferred api-ms-win-core-string-l1-1-0
PE 7f16c3a10000- 7f16c3a14000 Deferred api-ms-win-core-localization-l1-2-1
PE 7f16c3a20000- 7f16c3a24000 Deferred api-ms-win-core-fibers-l1-1-1
PE 7f16c3a40000- 7f16c3a44000 Deferred api-ms-win-core-synch-l1-2-0
PE 7f16c5f00000- 7f16c5f04000 Deferred kerberos
PE 7f16c7670000- 7f16c7675000 Deferred uxtheme
PE 7f16c9df0000- 7f16c9df5000 Deferred winex11
PE 7f16c9e90000- 7f16c9e94000 Deferred dhcpcsvc
PE 7f16c9eb0000- 7f16c9eb5000 Deferred ncrypt
PE 7f16c9ed0000- 7f16c9fa4000 Deferred cryptui
PE 7f16c9fd0000- 7f16c9fd4000 Deferred dxva2
PE 7f16ca020000- 7f16ca029000 Deferred wined3d
PE 7f16ca1e0000- 7f16ca1e4000 Deferred wtsapi32
PE 7f16ca200000- 7f16ca20d000 Deferred mpr
PE 7f16ca230000- 7f16ca251000 Deferred wininet
PE 7f16ca2d0000- 7f16ca2e3000 Deferred urlmon
PE 7f16ca390000- 7f16ca395000 Deferred bcrypt
PE 7f16ca3c0000- 7f16ca406000 Deferred crypt32
PE 7f16ca4b0000- 7f16ca4b6000 Deferred wintrust
PE 7f16ca4f0000- 7f16ca50d000 Deferred credui
PE 7f16ca540000- 7f16ca550000 Deferred msvcrt
PE 7f16ca610000- 7f16ca617000 Deferred winevulkan
PE 7f16ca650000- 7f16ca657000 Deferred vulkan-1
PE 7f16ca670000- 7f16ca676000 Deferred jsproxy
PE 7f16ca690000- 7f16ca697000 Deferred winhttp
PE 7f16ca6e0000- 7f16ca6e5000 Deferred dwmapi
PE 7f16ca700000- 7f16ca704000 Deferred dwrite
PE 7f16ca790000- 7f16ca797000 Deferred propsys
PE 7f16ca7c0000- 7f16ca7c4000 Deferred userenv
PE 7f16caa00000- 7f16caa07000 Deferred dbghelp
PE 7f16caa70000- 7f16caa7d000 Deferred winspool
PE 7f16caac0000- 7f16cab69000 Deferred comdlg32
PE 7f16cabd0000- 7f16cabd5000 Deferred hid
PE 7f16cabf0000- 7f16cabf5000 Deferred psapi
PE 7f16cac10000- 7f16cac27000 Deferred oleacc
PE 7f16cac80000- 7f16cac86000 Deferred iphlpapi
PE 7f16cacb0000- 7f16cacb7000 Deferred netapi32
PE 7f16cacf0000- 7f16cacf4000 Deferred secur32
PE 7f16cad30000- 7f16cad36000 Deferred ws2_32
PE 7f16cad80000- 7f16cad85000 Deferred msdmo
PE 7f16cada0000- 7f16cadb7000 Deferred setupapi
PE 7f16cae40000- 7f16cae4d000 Deferred oleaut32
PE 7f16cafb0000- 7f16cafb6000 Deferred imm32
PE 7f16cafe0000- 7f16cafe4000 Deferred usp10
PE 7f16cb030000- 7f16cb083000 Deferred comctl32
PE 7f16cb190000- 7f16cb19a000 Deferred aclui
PE 7f16cb1b0000- 7f16cb1bb000 Deferred rpcrt4
PE 7f16cb270000- 7f16cb29c000 Deferred ole32
PE 7f16cb410000- 7f16cb415000 Deferred shcore
PE 7f16cb450000- 7f16cbd47000 Deferred shell32
PE 7f16cbe80000- 7f16cbefa000 Deferred winmm
PE 7f16cbf40000- 7f16cbf45000 Deferred version
PE 7f16cbf70000- 7f16cbf7b000 Deferred advapi32
PE 7f16cc010000- 7f16cc01c000 Deferred gdi32
PE 7f16cc1a0000- 7f16cc291000 Deferred user32
PE 7f16cc410000- 7f16cc41f000 Deferred shlwapi
PE 7f16cd8c0000- 7f16cd8c3000 Deferred wow64cpu
Threads:
process tid prio (all id:s are in hex)
00000008 Steam.exe
[“S:\Program Files (x86)\Steam\Steam.exe” -no-cef-sandbox -console steam://rungameid/814380]
00000069 0
00000049 0
00000048 0
00000045 0
00000044 0
00000043 0
00000042 0
00000041 0
00000040 0
0000003f 0
0000003e 0
0000003c 2
0000003b 2
00000038 0
00000036 0
00000035 0
00000032 0
00000030 0
0000002f 0
0000002c 0
0000002b 0
0000002a 0
00000009 0
0000000e services.exe
[C:\windows\system32\services.exe]
00000022 0
0000001d 0
00000017 0
00000016 0
00000015 0
00000010 0
0000000f 0
00000011 explorer.exe
[C:\windows\system32\explorer.exe /desktop]
00000028 0
00000027 0
00000026 0
00000012 0
00000013 winedevice.exe
[C:\windows\system32\winedevice.exe]
0000001a 0
00000019 0
00000018 0
00000014 0
0000001b plugplay.exe
[C:\windows\system32\plugplay.exe]
0000001f 0
0000001e 0
0000001c 0
00000020 winedevice.exe
[C:\windows\system32\winedevice.exe]
00000029 0
00000025 0
00000024 0
00000023 0
00000021 0
0000002d steamwebhelper.exe
[“S:\Program Files (x86)\Steam\bin\cef\cef.win7x64\steamwebhelper.exe” “-lang=en_US” “-cachedir=C:\users\caleb\Local Settings\Application Data\Steam\htmlcache” “-steampid=8” “-buildid=1551832902” “-steamid=0” “-steamuniverse=Dev” “-clientui=S:\Program Files (x86)\Steam\clientui” --disable-out-of-process-pac --enable-blink-features=ResizeObserver,Worklet,AudioWorklet --disable-features=TouchpadAndWheelScrollLatching,AsyncWheelEvents --enable-media-stream --disable-smooth-scrolling --num-raster-threads=4 --enable-direct-write --no-sandbox “–log-file=S:\Program Files (x86)\Steam\logs\cef_log.txt” --no-sandbox]
00000068 0
00000067 0
00000066 0
00000065 0
00000064 0
00000063 0
00000062 0
00000061 0
00000060 0
0000005d -2
0000005c 0
0000005b 0
0000005a 0
00000059 0
00000058 -2
00000057 0
00000056 0
00000055 0
00000054 0
00000053 -2
00000052 0
00000051 -2
00000050 0
0000004f 0
0000004e 0
0000004d 0
0000004c 0
0000004b 0
0000002e 0
0000005e (D) S:\Program Files (x86)\Steam\bin\cef\cef.win7x64\steamwebhelper.exe
[“S:\Program Files (x86)\Steam\bin\cef\cef.win7x64\steamwebhelper.exe” --type=gpu-process --disable-features=AsyncWheelEvents,TouchpadAndWheelScrollLatching --no-sandbox --log-file=“S:\Program Files (x86)\Steam\logs\cef_log.txt” --product-version=“Valve Steam Client” --webview-urls=http://localhost/,http://steamloopback.host/,https://steamloopback.host/,https://localhost/ --lang=en-US --buildid=1551832902 --steamid=0 --gpu-preferences=KAAAAAAAAACAAwBAAQAAAAAAAAAAAGAAEAAAAAAAAAAAAAAAAAAAACgAAAAEAAAAIAAAAAAAAAAoAAAAAAAAADAAAAAAAAAAOAAAAAAAAAAQAAAAAAAAAAAAAAAKAAAAEAAAAAAAAAAAAAAACwAAABAAAAAAAAAAAQAAAAoAAAAQAAAAAAAAAAEAAAALAAAA --log-file=“S:\Program Files (x86)\Steam\logs\cef_log.txt” --product-version=“Valve Steam Client” --webview-urls=http://localhost/,http://steamloopback.host/,https://steamloopback.host/,https://localhost/ --lang=en-US --buildid=1551832902 --steamid=0 --service-request-channel-token=8C2DB21C8F7F9DBD275835F2008B7DE5 --mojo-platform-channel-handle=528 /prefetch:2 --no-sandbox]
0000006b 0
0000006a 0
0000005f 0 <==
00000071 gldriverquery.exe
[.\bin\gldriverquery.exe]
00000072 0
System information:
Wine build: wine-4.4.r2.g18e878bc ( TkG Staging Esync )
Platform: x86_64
Version: Windows 10
Host system: Linux
Host version: 5.0.8-050008-generic
[0417/105100.460:ERROR:registration_protocol_win.cc(56)] CreateFile: File not found. (0x2)
[0417/105100.460:INFO:crash_reporting.cc(242)] Crash reporting enabled for process: gpu-process
info: Game: steamwebhelper.exe
info: DXVK: v1.0.3
warn: OpenVR: Failed to locate module
info: Enabled instance extensions:
info: VK_KHR_get_physical_device_properties2
info: VK_KHR_surface
info: VK_KHR_win32_surface
err: DxvkInstance::createInstance: Failed to create Vulkan instance
err: D3D11CreateDevice: Failed to create a DXGI factory
[0417/105100.512:ERROR:gl_surface_egl.cc(863)] eglInitialize D3D11 failed with error EGL_NOT_INITIALIZED, trying next display type
wine: Unhandled page fault on read access to 0x00000000 at address 0x7fea04f2be88 (thread 0075), starting debugger…
Unhandled exception: page fault on read access to 0x00000000 in 64-bit code (0x00007fea04f2be88).
Register dump:
rip:00007fea04f2be88 rsp:000000000024e8b0 rbp:0000000000000000 eflags:00010246 ( R- – I Z- -P- )
rax:00007fea0547f6e4 rbx:00007fe9c4000b20 rcx:0000000000000001 rdx:0000000000000003
rsi:000000000024e8f0 rdi:0000000000000000 r8:00007fe9c4017480 r9:000000000024e970 r10:0000000000000082
r11:0000000000000000 r12:000000000024e920 r13:000000000024e8f0 r14:0000000000000000 r15:0000000000000000
Stack dump:
0x000000000024e8b0: 00007fe9c4000b20 0000000000000000
0x000000000024e8c0: 000000000024e920 000000000024e8f0
0x000000000024e8d0: 0000000000000000 00007fea05186146
0x000000000024e8e0: 0000000000000000 0000000000000001
0x000000000024e8f0: 00007fe9c400b550 0000000000000008
0x000000000024e900: 0000000000000000 0000000000000000
0x000000000024e910: 00007fea0547f6e4 0000000000000000
0x000000000024e920: 0000000000000000 4fe2794f0bb8d900
0x000000000024e930: 000000000420002c 00007fe9c4000b20
0x000000000024e940: 0000000000000000 00000000000ef150
0x000000000024e950: 00000000000d34d0 0000000000000000
0x000000000024e960: 000000000691c390 00007fea051864c0
Backtrace:
=>0 0x00007fea04f2be88 (0x0000000000000000)
0x00007fea04f2be88: movl (%rdi),%eax
Modules:
Module Address Debug info Name (75 modules)
PE 250000- 65f9000 Deferred libcef
PE 6600000- 66a5000 Deferred chrome_elf
PE 83c0000- 87ee000 Deferred d3dcompiler_47
PE 87f0000- 8ca3000 Deferred libglesv2
PE 8cb0000- 8cd1000 Deferred libegl
PE 6a340000- 6a57f000 Deferred d3d11
PE 6f200000- 6f37e000 Deferred dxgi
PE 7a850000- 7a858000 Deferred opengl32
PE 7b420000- 7b5e0000 Deferred kernel32
PE 7bc20000- 7bc33000 Deferred ntdll
PE 140000000- 14066d000 Deferred steamwebhelper
PE 180000000- 18010b000 Deferred sdl2
PE 7fe9fec50000- 7fe9fec55000 Deferred mfplat
PE 7fe9feca0000- 7fe9feca5000 Deferred mf
PE 7fe9fecd0000- 7fe9fecd6000 Deferred cfgmgr32
PE 7fe9fecf0000- 7fe9fecf4000 Deferred api-ms-win-core-file-l2-1-1
PE 7fe9ff180000- 7fe9ff184000 Deferred api-ms-win-core-localization-obsolete-l1-2-0
PE 7fe9ff1a0000- 7fe9ff1a4000 Deferred api-ms-win-core-datetime-l1-1-1
PE 7fe9ff1b0000- 7fe9ff1b4000 Deferred api-ms-win-core-string-l1-1-0
PE 7fe9ff1d0000- 7fe9ff1d4000 Deferred api-ms-win-core-localization-l1-2-1
PE 7fe9ff1e0000- 7fe9ff1e4000 Deferred api-ms-win-core-fibers-l1-1-1
PE 7fe9ff300000- 7fe9ff304000 Deferred api-ms-win-core-synch-l1-2-0
PE 7fea017c0000- 7fea017c4000 Deferred kerberos
PE 7fea02f30000- 7fea02f35000 Deferred uxtheme
PE 7fea056b0000- 7fea056b5000 Deferred winex11
PE 7fea05750000- 7fea05754000 Deferred dhcpcsvc
PE 7fea05770000- 7fea05775000 Deferred ncrypt
PE 7fea05790000- 7fea05864000 Deferred cryptui
PE 7fea05890000- 7fea05894000 Deferred dxva2
PE 7fea058e0000- 7fea058e9000 Deferred wined3d
PE 7fea05aa0000- 7fea05aa4000 Deferred wtsapi32
PE 7fea05ac0000- 7fea05acd000 Deferred mpr
PE 7fea05af0000- 7fea05b11000 Deferred wininet
PE 7fea05b90000- 7fea05ba3000 Deferred urlmon
PE 7fea05c50000- 7fea05c55000 Deferred bcrypt
PE 7fea05c80000- 7fea05cc6000 Deferred crypt32
PE 7fea05d70000- 7fea05d76000 Deferred wintrust
PE 7fea05db0000- 7fea05dcd000 Deferred credui
PE 7fea05e00000- 7fea05e10000 Deferred msvcrt
PE 7fea05ed0000- 7fea05ed7000 Deferred winevulkan
PE 7fea05f10000- 7fea05f17000 Deferred vulkan-1
PE 7fea05f30000- 7fea05f36000 Deferred jsproxy
PE 7fea05f50000- 7fea05f57000 Deferred winhttp
PE 7fea05fa0000- 7fea05fa5000 Deferred dwmapi
PE 7fea05fc0000- 7fea05fc4000 Deferred dwrite
PE 7fea06050000- 7fea06057000 Deferred propsys
PE 7fea06080000- 7fea06084000 Deferred userenv
PE 7fea062c0000- 7fea062c7000 Deferred dbghelp
PE 7fea06330000- 7fea0633d000 Deferred winspool
PE 7fea06380000- 7fea06429000 Deferred comdlg32
PE 7fea06490000- 7fea06495000 Deferred hid
PE 7fea064b0000- 7fea064b5000 Deferred psapi
PE 7fea064d0000- 7fea064e7000 Deferred oleacc
PE 7fea06540000- 7fea06546000 Deferred iphlpapi
PE 7fea06570000- 7fea06577000 Deferred netapi32
PE 7fea065b0000- 7fea065b4000 Deferred secur32
PE 7fea065f0000- 7fea065f6000 Deferred ws2_32
PE 7fea06640000- 7fea06645000 Deferred msdmo
PE 7fea06660000- 7fea06677000 Deferred setupapi
PE 7fea06700000- 7fea0670d000 Deferred oleaut32
PE 7fea06870000- 7fea06876000 Deferred imm32
PE 7fea068a0000- 7fea068a4000 Deferred usp10
PE 7fea068f0000- 7fea06943000 Deferred comctl32
PE 7fea06a50000- 7fea06a5a000 Deferred aclui
PE 7fea06a70000- 7fea06a7b000 Deferred rpcrt4
PE 7fea06b30000- 7fea06b5c000 Deferred ole32
PE 7fea06cd0000- 7fea06cd5000 Deferred shcore
PE 7fea06d10000- 7fea07607000 Deferred shell32
PE 7fea07740000- 7fea077ba000 Deferred winmm
PE 7fea07800000- 7fea07805000 Deferred version
PE 7fea07830000- 7fea0783b000 Deferred advapi32
PE 7fea078d0000- 7fea078dc000 Deferred gdi32
PE 7fea07a60000- 7fea07b51000 Deferred user32
PE 7fea07cd0000- 7fea07cdf000 Deferred shlwapi
PE 7fea09180000- 7fea09183000 Deferred wow64cpu
Threads:
process tid prio (all id:s are in hex)
00000008 Steam.exe
[“S:\Program Files (x86)\Steam\Steam.exe” -no-cef-sandbox -console steam://rungameid/814380]
00000078 0
00000073 0
00000069 0
00000049 0
00000048 0
00000045 0
00000044 0
00000043 0
00000042 0
00000041 0
00000040 0
0000003f 0
0000003e 0
0000003c 2
0000003b 2
00000038 0
00000036 0
00000035 0
00000032 0
00000030 0
0000002f 0
0000002c 0
0000002b 0
0000002a 0
00000009 0
0000000e services.exe
[C:\windows\system32\services.exe]
00000022 0
0000001d 0
00000017 0
00000016 0
00000015 0
00000010 0
0000000f 0
00000011 explorer.exe
[C:\windows\system32\explorer.exe /desktop]
00000028 0
00000027 0
00000026 0
00000012 0
00000013 winedevice.exe
[C:\windows\system32\winedevice.exe]
0000001a 0
00000019 0
00000018 0
00000014 0
0000001b plugplay.exe
[C:\windows\system32\plugplay.exe]
0000001f 0
0000001e 0
0000001c 0
00000020 winedevice.exe
[C:\windows\system32\winedevice.exe]
00000029 0
00000025 0
00000024 0
00000023 0
00000021 0
0000002d steamwebhelper.exe
[“S:\Program Files (x86)\Steam\bin\cef\cef.win7x64\steamwebhelper.exe” “-lang=en_US” “-cachedir=C:\users\caleb\Local Settings\Application Data\Steam\htmlcache” “-steampid=8” “-buildid=1551832902” “-steamid=0” “-steamuniverse=Dev” “-clientui=S:\Program Files (x86)\Steam\clientui” --disable-out-of-process-pac --enable-blink-features=ResizeObserver,Worklet,AudioWorklet --disable-features=TouchpadAndWheelScrollLatching,AsyncWheelEvents --enable-media-stream --disable-smooth-scrolling --num-raster-threads=4 --enable-direct-write --no-sandbox “–log-file=S:\Program Files (x86)\Steam\logs\cef_log.txt” --no-sandbox]
00000068 0
00000067 0
00000066 0
00000065 0
00000064 0
00000063 0
00000062 0
00000061 0
00000060 0
0000005d -2
0000005c 0
0000005b 0
0000005a 0
00000059 0
00000058 -2
00000057 0
00000056 0
00000055 0
00000054 0
00000053 -2
00000052 0
00000051 -2
00000050 0
0000004f 0
0000004e 0
0000004d 0
0000004c 0
0000004b 0
0000002e 0
00000074 (D) S:\Program Files (x86)\Steam\bin\cef\cef.win7x64\steamwebhelper.exe
[“S:\Program Files (x86)\Steam\bin\cef\cef.win7x64\steamwebhelper.exe” --type=gpu-process --disable-features=AsyncWheelEvents,TouchpadAndWheelScrollLatching --no-sandbox --log-file=“S:\Program Files (x86)\Steam\logs\cef_log.txt” --product-version=“Valve Steam Client” --webview-urls=http://localhost/,http://steamloopback.host/,https://steamloopback.host/,https://localhost/ --lang=en-US --buildid=1551832902 --steamid=0 --gpu-preferences=KAAAAAAAAACAAwBAAQAAAAAAAAAAAGAAEAAAAAAAAAAAAAAAAAAAACgAAAAEAAAAIAAAAAAAAAAoAAAAAAAAADAAAAAAAAAAOAAAAAAAAAAQAAAAAAAAAAAAAAAKAAAAEAAAAAAAAAAAAAAACwAAABAAAAAAAAAAAQAAAAoAAAAQAAAAAAAAAAEAAAALAAAA --log-file=“S:\Program Files (x86)\Steam\logs\cef_log.txt” --product-version=“Valve Steam Client” --webview-urls=http://localhost/,http://steamloopback.host/,https://steamloopback.host/,https://localhost/ --lang=en-US --buildid=1551832902 --steamid=0 --service-request-channel-token=EA26BEA298499013BA199461F69C4EB8 --mojo-platform-channel-handle=532 /prefetch:2 --no-sandbox]
00000077 0
00000076 0
00000075 0 <==
System information:
Wine build: wine-4.4.r2.g18e878bc ( TkG Staging Esync )
Platform: x86_64
Version: Windows 10
Host system: Linux
Host version: 5.0.8-050008-generic
[0417/105101.306:ERROR:registration_protocol_win.cc(56)] CreateFile: File not found. (0x2)
[0417/105101.307:INFO:crash_reporting.cc(242)] Crash reporting enabled for process: gpu-process
info: Game: steamwebhelper.exe
info: DXVK: v1.0.3
warn: OpenVR: Failed to locate module
info: Enabled instance extensions:
info: VK_KHR_get_physical_device_properties2
info: VK_KHR_surface
info: VK_KHR_win32_surface
err: DxvkInstance::createInstance: Failed to create Vulkan instance
err: D3D11CreateDevice: Failed to create a DXGI factory
[0417/105101.359:ERROR:gl_surface_egl.cc(863)] eglInitialize D3D11 failed with error EGL_NOT_INITIALIZED, trying next display type
wine: Unhandled page fault on read access to 0x00000000 at address 0x7ff3d80e3e88 (thread 007d), starting debugger…
Unhandled exception: page fault on read access to 0x00000000 in 64-bit code (0x00007ff3d80e3e88).
Register dump:
rip:00007ff3d80e3e88 rsp:000000000024e8b0 rbp:0000000000000000 eflags:00010246 ( R- – I Z- -P- )
rax:00007ff3d86376e4 rbx:00007ff38c000b20 rcx:0000000000000001 rdx:0000000000000003
rsi:000000000024e8f0 rdi:0000000000000000 r8:00007ff38c017480 r9:000000000024e970 r10:0000000000000082
r11:0000000000000000 r12:000000000024e920 r13:000000000024e8f0 r14:0000000000000000 r15:0000000000000000
Stack dump:
0x000000000024e8b0: 00007ff38c000b20 0000000000000000
0x000000000024e8c0: 000000000024e920 000000000024e8f0
0x000000000024e8d0: 0000000000000000 00007ff3d833e146
0x000000000024e8e0: 0000000000000000 0000000000000001
0x000000000024e8f0: 00007ff38c00b550 0000000000000008
0x000000000024e900: 0000000000000000 0000000000000000
0x000000000024e910: 00007ff3d86376e4 0000000000000000
0x000000000024e920: 0000000000000000 02de0bfbbcce7a00
0x000000000024e930: 000000000420002c 00007ff38c000b20
0x000000000024e940: 0000000000000000 00000000000ef190
0x000000000024e950: 00000000000d3510 0000000000000000
0x000000000024e960: 000000000691c390 00007ff3d833e4c0
Backtrace:
=>0 0x00007ff3d80e3e88 (0x0000000000000000)
0x00007ff3d80e3e88: movl (%rdi),%eax
Modules:
Module Address Debug info Name (75 modules)
PE 250000- 65f9000 Deferred libcef
PE 6600000- 66a5000 Deferred chrome_elf
PE 83c0000- 87ee000 Deferred d3dcompiler_47
PE 87f0000- 8ca3000 Deferred libglesv2
PE 8cb0000- 8cd1000 Deferred libegl
PE 6a340000- 6a57f000 Deferred d3d11
PE 6f200000- 6f37e000 Deferred dxgi
PE 7a850000- 7a858000 Deferred opengl32
PE 7b420000- 7b5e0000 Deferred kernel32
PE 7bc20000- 7bc33000 Deferred ntdll
PE 140000000- 14066d000 Deferred steamwebhelper
PE 180000000- 18010b000 Deferred sdl2
PE 7ff3d1f10000- 7ff3d1f15000 Deferred mfplat
PE 7ff3d1f60000- 7ff3d1f65000 Deferred mf
PE 7ff3d1f90000- 7ff3d1f96000 Deferred cfgmgr32
PE 7ff3d1fb0000- 7ff3d1fb4000 Deferred api-ms-win-core-file-l2-1-1
PE 7ff3d2440000- 7ff3d2444000 Deferred api-ms-win-core-localization-obsolete-l1-2-0
PE 7ff3d2450000- 7ff3d2454000 Deferred api-ms-win-core-datetime-l1-1-1
PE 7ff3d2470000- 7ff3d2474000 Deferred api-ms-win-core-string-l1-1-0
PE 7ff3d2480000- 7ff3d2484000 Deferred api-ms-win-core-localization-l1-2-1
PE 7ff3d24a0000- 7ff3d24a4000 Deferred api-ms-win-core-fibers-l1-1-1
PE 7ff3d24b0000- 7ff3d24b4000 Deferred api-ms-win-core-synch-l1-2-0
PE 7ff3d4980000- 7ff3d4984000 Deferred kerberos
PE 7ff3d60f0000- 7ff3d60f5000 Deferred uxtheme
PE 7ff3d8860000- 7ff3d8865000 Deferred winex11
PE 7ff3d8910000- 7ff3d8914000 Deferred dhcpcsvc
PE 7ff3d8920000- 7ff3d8925000 Deferred ncrypt
PE 7ff3d8940000- 7ff3d8a14000 Deferred cryptui
PE 7ff3d8a50000- 7ff3d8a54000 Deferred dxva2
PE 7ff3d8a90000- 7ff3d8a99000 Deferred wined3d
PE 7ff3d8c60000- 7ff3d8c64000 Deferred wtsapi32
PE 7ff3d8c80000- 7ff3d8c8d000 Deferred mpr
PE 7ff3d8cb0000- 7ff3d8cd1000 Deferred wininet
PE 7ff3d8d40000- 7ff3d8d53000 Deferred urlmon
PE 7ff3d8e00000- 7ff3d8e05000 Deferred bcrypt
PE 7ff3d8e30000- 7ff3d8e76000 Deferred crypt32
PE 7ff3d8f20000- 7ff3d8f26000 Deferred wintrust
PE 7ff3d8f60000- 7ff3d8f7d000 Deferred credui
PE 7ff3d8fb0000- 7ff3d8fc0000 Deferred msvcrt
PE 7ff3d9080000- 7ff3d9087000 Deferred winevulkan
PE 7ff3d90d0000- 7ff3d90d7000 Deferred vulkan-1
PE 7ff3d90f0000- 7ff3d90f6000 Deferred jsproxy
PE 7ff3d9110000- 7ff3d9117000 Deferred winhttp
PE 7ff3d9150000- 7ff3d9155000 Deferred dwmapi
PE 7ff3d9170000- 7ff3d9174000 Deferred dwrite
PE 7ff3d9200000- 7ff3d9207000 Deferred propsys
PE 7ff3d9230000- 7ff3d9234000 Deferred userenv
PE 7ff3d9470000- 7ff3d9477000 Deferred dbghelp
PE 7ff3d94f0000- 7ff3d94fd000 Deferred winspool
PE 7ff3d9540000- 7ff3d95e9000 Deferred comdlg32
PE 7ff3d9650000- 7ff3d9655000 Deferred hid
PE 7ff3d9670000- 7ff3d9675000 Deferred psapi
PE 7ff3d9680000- 7ff3d9697000 Deferred oleacc
PE 7ff3d96f0000- 7ff3d96f6000 Deferred iphlpapi
PE 7ff3d9730000- 7ff3d9737000 Deferred netapi32
PE 7ff3d9760000- 7ff3d9764000 Deferred secur32
PE 7ff3d97b0000- 7ff3d97b6000 Deferred ws2_32
PE 7ff3d97f0000- 7ff3d97f5000 Deferred msdmo
PE 7ff3d9820000- 7ff3d9837000 Deferred setupapi
PE 7ff3d98b0000- 7ff3d98bd000 Deferred oleaut32
PE 7ff3d9a20000- 7ff3d9a26000 Deferred imm32
PE 7ff3d9a50000- 7ff3d9a54000 Deferred usp10
PE 7ff3d9aa0000- 7ff3d9af3000 Deferred comctl32
PE 7ff3d9c00000- 7ff3d9c0a000 Deferred aclui
PE 7ff3d9c30000- 7ff3d9c3b000 Deferred rpcrt4
PE 7ff3d9cf0000- 7ff3d9d1c000 Deferred ole32
PE 7ff3d9e90000- 7ff3d9e95000 Deferred shcore
PE 7ff3d9ed0000- 7ff3da7c7000 Deferred shell32
PE 7ff3da8f0000- 7ff3da96a000 Deferred winmm
PE 7ff3da9c0000- 7ff3da9c5000 Deferred version
PE 7ff3da9e0000- 7ff3da9eb000 Deferred advapi32
PE 7ff3daa90000- 7ff3daa9c000 Deferred gdi32
PE 7ff3dac20000- 7ff3dad11000 Deferred user32
PE 7ff3dae80000- 7ff3dae8f000 Deferred shlwapi
PE 7ff3dc330000- 7ff3dc333000 Deferred wow64cpu
Threads:
process tid prio (all id:s are in hex)
00000008 Steam.exe
[“S:\Program Files (x86)\Steam\Steam.exe” -no-cef-sandbox -console steam://rungameid/814380]
00000078 0
00000073 0
00000069 0
00000049 0
00000048 0
00000045 0
00000044 0
00000043 0
00000042 0
00000041 0
00000040 0
0000003f 0
0000003e 0
0000003c 2
0000003b 2
00000038 0
00000036 0
00000035 0
00000032 0
00000030 0
0000002f 0
0000002c 0
0000002b 0
0000002a 0
00000009 0
0000000e services.exe
[C:\windows\system32\services.exe]
00000022 0
0000001d 0
00000017 0
00000016 0
00000015 0
00000010 0
0000000f 0
00000011 explorer.exe
[C:\windows\system32\explorer.exe /desktop]
00000028 0
00000027 0
00000026 0
00000012 0
00000013 winedevice.exe
[C:\windows\system32\winedevice.exe]
0000001a 0
00000019 0
00000018 0
00000014 0
0000001b plugplay.exe
[C:\windows\system32\plugplay.exe]
0000001f 0
0000001e 0
0000001c 0
00000020 winedevice.exe
[C:\windows\system32\winedevice.exe]
00000029 0
00000025 0
00000024 0
00000023 0
00000021 0
0000002d steamwebhelper.exe
[“S:\Program Files (x86)\Steam\bin\cef\cef.win7x64\steamwebhelper.exe” “-lang=en_US” “-cachedir=C:\users\caleb\Local Settings\Application Data\Steam\htmlcache” “-steampid=8” “-buildid=1551832902” “-steamid=0” “-steamuniverse=Dev” “-clientui=S:\Program Files (x86)\Steam\clientui” --disable-out-of-process-pac --enable-blink-features=ResizeObserver,Worklet,AudioWorklet --disable-features=TouchpadAndWheelScrollLatching,AsyncWheelEvents --enable-media-stream --disable-smooth-scrolling --num-raster-threads=4 --enable-direct-write --no-sandbox “–log-file=S:\Program Files (x86)\Steam\logs\cef_log.txt” --no-sandbox]
00000068 0
00000067 0
00000066 0
00000065 0
00000064 0
00000063 0
00000062 0
00000061 0
00000060 0
0000005d -2
0000005c 0
0000005b 0
0000005a 0
00000059 0
00000058 -2
00000057 0
00000056 0
00000055 0
00000054 0
00000053 -2
00000052 0
00000051 -2
00000050 0
0000004f 0
0000004e 0
0000004d 0
0000004c 0
0000004b 0
0000002e 0
0000007c (D) S:\Program Files (x86)\Steam\bin\cef\cef.win7x64\steamwebhelper.exe
[“S:\Program Files (x86)\Steam\bin\cef\cef.win7x64\steamwebhelper.exe” --type=gpu-process --disable-features=AsyncWheelEvents,TouchpadAndWheelScrollLatching --no-sandbox --log-file=“S:\Program Files (x86)\Steam\logs\cef_log.txt” --product-version=“Valve Steam Client” --webview-urls=http://localhost/,http://steamloopback.host/,https://steamloopback.host/,https://localhost/ --lang=en-US --buildid=1551832902 --steamid=0 --gpu-preferences=KAAAAAAAAACAAwBAAQAAAAAAAAAAAGAAEAAAAAAAAAAAAAAAAAAAACgAAAAEAAAAIAAAAAAAAAAoAAAAAAAAADAAAAAAAAAAOAAAAAAAAAAQAAAAAAAAAAAAAAAKAAAAEAAAAAAAAAAAAAAACwAAABAAAAAAAAAAAQAAAAoAAAAQAAAAAAAAAAEAAAALAAAA --log-file=“S:\Program Files (x86)\Steam\logs\cef_log.txt” --product-version=“Valve Steam Client” --webview-urls=http://localhost/,http://steamloopback.host/,https://steamloopback.host/,https://localhost/ --lang=en-US --buildid=1551832902 --steamid=0 --service-request-channel-token=82932AAA9DA8DCCF00DDC29F85DFF17F --mojo-platform-channel-handle=580 /prefetch:2 --no-sandbox]
0000007f 0
0000007e 0
0000007d 0 <==
System information:
Wine build: wine-4.4.r2.g18e878bc ( TkG Staging Esync )
Platform: x86_64
Version: Windows 10
Host system: Linux
Host version: 5.0.8-050008-generic
[0417/105102.163:ERROR:registration_protocol_win.cc(56)] CreateFile: File not found. (0x2)
[0417/105102.163:INFO:crash_reporting.cc(242)] Crash reporting enabled for process: gpu-process
[0417/105102.234:ERROR:mf_helpers.cc(14)] Error in dxva_video_decode_accelerator_win.cc on line 379
[0417/105104.339:ERROR:registration_protocol_win.cc(56)] CreateFile: File not found. (0x2)
[0417/105104.340:INFO:crash_reporting.cc(242)] Crash reporting enabled for process: renderer
[0417/105105.596:ERROR:gpu_process_transport_factory.cc(1026)] Lost UI shared context.
[0417/105105.989:ERROR:registration_protocol_win.cc(56)] CreateFile: File not found. (0x2)
[0417/105105.991:INFO:crash_reporting.cc(242)] Crash reporting enabled for process: renderer
[0417/105106.704:ERROR:command_buffer_proxy_impl.cc(132)] ContextResult::kTransientFailure: Failed to send GpuChannelMsg_CreateCommandBuffer.
[0417/105107.256:WARNING:cert_verify_proc_win.cc(104)] Unknown error -2146762482 mapped to net::ERR_FAILED
[0417/105114.424:ERROR:registration_protocol_win.cc(56)] CreateFile: File not found. (0x2)
[0417/105114.425:INFO:crash_reporting.cc(242)] Crash reporting enabled for process: gpu-process
[0417/105114.500:ERROR:mf_helpers.cc(14)] Error in dxva_video_decode_accelerator_win.cc on line 379
System page size: 4096
Could not find page for trampoline in +/- 2GB range of function to hook
Error allocating trampoline memory (no memory within +/-2gb? prior failures?)

0 Likes

#4

What if you disconnect the controller, get any luck?

0 Likes

#5

Nope, same result as before.

0 Likes

#6

Proton: Missing or invalid openvrpaths.vrpath file! [Errno 2] No such file or directory: ‘/home/caleb/.config/openvr/openvrpaths.vrpath’

Does the file exist?

0 Likes

#7

Missing the folder /home/caleb/.config/openvr so the file isn’t there

0 Likes

#8

Try running with the beta version (or whatever the newest are, I’m just reading the logs on my phone) of proton for the heck of it and see if it spews the same errors

0 Likes

#9

I’ve been running the latest version of proton 4.2-2. When I run it with Proton 3.16-8 Beta I don’t even get a black window launching for a few seconds. In the terminal it seems to have the same error.

~$ steam steam://run/814380

Running Steam on ubuntu 18.04 64-bit
STEAM_RUNTIME is enabled automatically
Pins up-to-date!
Installing breakpad exception handler for appid(steam)/version(1550534751)
Installing breakpad exception handler for appid(steam)/version(1550534751)
Gtk-Message: 12:19:33.748: Failed to load module “gail”
Gtk-Message: 12:19:33.748: Failed to load module “atk-bridge”

(steam:12828): Gtk-WARNING **: 12:19:33.753: Unable to locate theme engine in module_path: “adwaita”,

(steam:12828): Gtk-WARNING **: 12:19:33.753: Unable to locate theme engine in module_path: “adwaita”,
/usr/share/themes/Arc-Dark/gtk-2.0/main.rc:1090: error: unexpected identifier ‘direction’, expected character ‘}’
/usr/share/themes/Arc-Dark/gtk-2.0/apps.rc:91: error: unexpected identifier ‘direction’, expected character ‘}’
Installing breakpad exception handler for appid(steam)/version(1550534751)
[0417/121934.139962:INFO:crash_reporting.cc(242)] Crash reporting enabled for process: browser
[0417/121934.170160:WARNING:crash_reporting.cc(281)] Failed to set crash key: UserID with value: 0
[0417/121934.170236:WARNING:crash_reporting.cc(281)] Failed to set crash key: BuildID with value: 1550527787
[0417/121934.170243:WARNING:crash_reporting.cc(281)] Failed to set crash key: SteamUniverse with value: Public
[0417/121934.170249:WARNING:crash_reporting.cc(281)] Failed to set crash key: Vendor with value: Valve
[0417/121934.175331:ERROR:gpu_process_transport_factory.cc(1026)] Lost UI shared context.
Installing breakpad exception handler for appid(steam)/version(1550534751)
Installing breakpad exception handler for appid(steam)/version(1550534751)
Installing breakpad exception handler for appid(steam)/version(1550534751)
Installing breakpad exception handler for appid(steam)/version(1550534751)
Installing breakpad exception handler for appid(steam)/version(1550534751)
Installing breakpad exception handler for appid(steam)/version(1550534751)
CApplicationManagerPopulateThread took 2 milliseconds to initialize (will have waited on CAppInfoCacheReadFromDiskThread)
Installing breakpad exception handler for appid(steam)/version(1550534751)
Installing breakpad exception handler for appid(steam)/version(1550534751)
Installing breakpad exception handler for appid(steam)/version(1550534751)
Installing breakpad exception handler for appid(steam)/version(1550534751)
Installing breakpad exception handler for appid(steam)/version(1550534751)
Installing breakpad exception handler for appid(steam)/version(1550534751)
Installing breakpad exception handler for appid(steam)/version(1550534751)
Installing breakpad exception handler for appid(steam)/version(1550534751)
Installing breakpad exception handler for appid(steam)/version(1550534751)

** (steam:12828): WARNING **: 12:19:34.341: Unknown device type 14

** (steam:12828): WARNING **: 12:19:34.341: Could not create object for /org/freedesktop/NetworkManager/Devices/1: unknown object type
CAppInfoCacheReadFromDiskThread took 58 milliseconds to initialize
Installing breakpad exception handler for appid(steam)/version(1550534751)
Opted-in Controller Mask for AppId 0: 0

** (steam:12828): WARNING **: 12:19:34.462: Ignoring invalid property ‘autoconnect-priority’

** (steam:12828): WARNING **: 12:19:34.462: Unknown setting ‘proxy’

** (steam:12828): WARNING **: 12:19:34.462: Ignoring invalid property ‘route-data’

** (steam:12828): WARNING **: 12:19:34.462: Ignoring invalid property ‘address-data’

** (steam:12828): WARNING **: 12:19:34.462: Ignoring invalid property ‘route-data’

** (steam:12828): WARNING **: 12:19:34.462: Ignoring invalid property ‘address-data’
Local Device Found
type: 0e6f 0213
path: sdl://0
serial_number: - 0
Manufacturer:
Product: Afterglow
Release: 100
Interface: -1

!! Steam controller device opened for index 0.
Steam Controller reserving XInput slot 0
Installing breakpad exception handler for appid(steam)/version(1550534751)

(steam:12828): Gtk-WARNING **: 12:19:34.826: gtk_disable_setlocale() must be called before gtk_init()
Controller 0 connected, configuring it now…
Installing breakpad exception handler for appid(steam)/version(1550534751)
Controller has an Invalid or missing unit serial number, setting to ‘e6f-213-c3cfd6d’
Installing breakpad exception handler for appid(steam)/version(1550534751)
Controller device closed after hid_read failure
!! Controller 0 attributes:
Type: 31
ProductID: 531
Serial: e6f-213-c3cfd6d
Capabilities: 001843ff
Firmware Version: 0
Firmware Build Time: 2147483647 (Tue, 19 Jan 2038 03:14:07 GMT)
Bootloader Build Time: 2147483647 (Tue, 19 Jan 2038 03:14:07 GMT)
Could not load local selection (), local override (/home/caleb/.local/share/Steam//controller_config/bigpicture.vdf), or user path (/home/caleb/.local/share/Steam/userdata/205323629/config/controller_configs/bigpicture.vdf), checking last resort path: /home/caleb/.local/share/Steam//controller_base/bigpicture.vdf
Loaded Config for Last Resort Path for App ID 413090: /home/caleb/.local/share/Steam//controller_base/bigpicture.vdf
[413090]Non-Steam Controller Configs Enabled: 1
Could not load local selection (), local override (/home/caleb/.local/share/Steam//controller_config/bigpicture.vdf), or user path (/home/caleb/.local/share/Steam/userdata/205323629/config/controller_configs/bigpicture.vdf), checking last resort path: /home/caleb/.local/share/Steam//controller_base/bigpicture.vdf
Loaded Config for Last Resort Path for App ID 413090: /home/caleb/.local/share/Steam//controller_base/bigpicture.vdf
Loaded Config for Local Override Path for App ID 413080: /home/caleb/.local/share/Steam//controller_base/empty.vdf
[413080]Non-Steam Controller Configs Enabled: 1
Controller 0 disconnected
Fatal : VkResult is “ERROR_INITIALIZATION_FAILED” in /home/pgriffais/src/Vulkan/base/vulkanexamplebase.cpp at line 823
vulkandriverquery: /home/pgriffais/src/Vulkan/base/vulkanexamplebase.cpp:823: void VulkanExampleBase::initVulkan(): Assertion `res == VK_SUCCESS’ failed.
Aborted (core dumped)
Installing breakpad exception handler for appid(steam)/version(1550534751)
Local Device Found
type: 0e6f 0213
path: sdl://0
serial_number: - 0
Manufacturer:
Product: Afterglow
Release: 100
Interface: -1

!! Steam controller device opened for index 0.
Steam Controller reserving XInput slot 0
roaming config store loaded successfully - 4952 bytes.
migrating temporary roaming config store
Controller 0 connected, configuring it now…
Controller has an Invalid or missing unit serial number, setting to ‘e6f-213-c3cfd6d’
[0417/121935.976016:INFO:crash_reporting.cc(265)] Crash reporting enabled for process: renderer
[0417/121936.005179:WARNING:crash_reporting.cc(281)] Failed to set crash key: UserID with value: 0
[0417/121936.005275:WARNING:crash_reporting.cc(281)] Failed to set crash key: BuildID with value: 1550527787
[0417/121936.005282:WARNING:crash_reporting.cc(281)] Failed to set crash key: SteamUniverse with value: Public
[0417/121936.005289:WARNING:crash_reporting.cc(281)] Failed to set crash key: Vendor with value: Valve
[0417/121936.005950:INFO:crash_reporting.cc(242)] Crash reporting enabled for process: gpu-process
Failed to init SteamVR because it isn’t installed
BYieldingQueryAccountsRegisteredToController
ExecCommandLine: “’/home/caleb/.local/share/Steam/ubuntu12_32/steam’ ‘steam://run/814380’”
ExecuteSteamURL: “steam://run/814380”
System startup time: 2.99 seconds
Opted-in Controller Mask for AppId 413080: 0
!! Controller 0 attributes:
Type: 31
ProductID: 531
Serial: e6f-213-c3cfd6d
Capabilities: 001843ff
Firmware Version: 0
Firmware Build Time: 2147483647 (Tue, 19 Jan 2038 03:14:07 GMT)
Bootloader Build Time: 2147483647 (Tue, 19 Jan 2038 03:14:07 GMT)
Loaded Config for Local Selection Path for App ID 413090: /home/caleb/.local/share/Steam/steamapps/workshop/content/241100/1689651975/1007024772344596662_legacy.bin
[413090]Non-Steam Controller Configs Enabled: 1
Loaded Config for Local Selection Path for App ID 413090: /home/caleb/.local/share/Steam/steamapps/workshop/content/241100/1557882944/956347096063782645_legacy.bin
Loaded Config for Local Override Path for App ID 413080: /home/caleb/.local/share/Steam//controller_base/empty.vdf
[413080]Non-Steam Controller Configs Enabled: 1
[0417/121936.522160:INFO:crash_reporting.cc(265)] Crash reporting enabled for process: renderer
Opted-in Controller Mask for AppId 814380: d
Loaded Config for Local Selection Path for App ID 814380: /home/caleb/.local/share/Steam/steamapps/workshop/content/241100/1668826331/994637970746554033_legacy.bin
[814380]Non-Steam Controller Configs Enabled: 1
Loaded Config for Local Override Path for App ID 814380: /home/caleb/.local/share/Steam//controller_base/empty.vdf
GameAction [AppID 814380, ActionID 1] : LaunchApp changed task to ProcessingInstallScript with “”
sh: 1: /home/caleb/.local/share/Steam/legacycompat/iscriptevaluator.exe: Exec format error
sh: 1: /home/caleb/.local/share/Steam/steamapps/common/Sekiro: Permission denied
sh: 1: /home/caleb/.local/share/Steam/steamapps/common/Steamworks Shared: Permission denied
[2019-04-17 12:19:33] Startup - updater built Feb 18 2019 22:08:53
[2019-04-17 12:19:33] Verifying installation…
[2019-04-17 12:19:33] Verification complete
installscript_posix.cpp (357) : Assertion Failed: strCommonRedistForeignInstallPath != “”
installscript_posix.cpp (357) : Assertion Failed: strCommonRedistForeignInstallPath != “”
Installing breakpad exception handler for appid(steam)/version(1550534751)
assert_20190417121936_25.dmp[13035]: Uploading dump (out-of-process)
/tmp/dumps/assert_20190417121936_25.dmp
installscript_posix.cpp (357) : Assertion Failed: strCommonRedistForeignInstallPath != “”
installscript_posix.cpp (357) : Assertion Failed: strCommonRedistForeignInstallPath != “”
JS method call WebChat.GetWebChatLanguage with 1 arguments
sh: 1: /home/caleb/.local/share/Steam/legacycompat/iscriptevaluator.exe: Exec format error
installscript_posix.cpp (418) : Assertion Failed: Standalone evaluator returned error code for app 814380
installscript_posix.cpp (418) : Assertion Failed: Standalone evaluator returned error code for app 814380
GameAction [AppID 814380, ActionID 1] : LaunchApp changed task to SynchronizingCloud with “”
JS method call WebChat.RegisterForFriendPostMessage with 1 arguments
JS method call WebChat.RegisterOverlayChatBrowserInfoChanged with 1 arguments
JS method call WebChat.GetSignIntoFriendsOnStart with 1 arguments
JS method call WebChat.GetCurrentUserAccountID with 1 arguments
JS method call WebChat.RegisterForFriendPostMessage with 1 arguments
JS method call WebChat.GetWebChatURL with 1 arguments
GameAction [AppID 814380, ActionID 1] : LaunchApp changed task to SiteLicenseSeatCheckout with “”
GameAction [AppID 814380, ActionID 1] : LaunchApp changed task to CreatingProcess with “”
GameAction [AppID 814380, ActionID 1] : LaunchApp waiting for user response to CreatingProcess “”
GameAction [AppID 814380, ActionID 1] : LaunchApp continues with user response “CreatingProcess”
Game update: AppID 814380 “”, ProcID 13039, IP 0.0.0.0:0
Loaded Config for Local Selection Path for App ID 814380: /home/caleb/.local/share/Steam/steamapps/workshop/content/241100/1668826331/994637970746554033_legacy.bin
Loaded Config for Local Override Path for App ID 814380: /home/caleb/.local/share/Steam//controller_base/empty.vdf

Adding process 13039 for game ID 814380
GameAction [AppID 814380, ActionID 1] : LaunchApp changed task to WaitingGameWindow with “”
GameAction [AppID 814380, ActionID 1] : LaunchApp changed task to Completed with “”
ERROR: ld.so: object ‘/home/caleb/.local/share/Steam/ubuntu12_32/gameoverlayrenderer.so’ from LD_PRELOAD cannot be preloaded (wrong ELF class: ELFCLASS32): ignored.
/bin/sh: 1: /home/caleb/.local/share/Steam/steamapps/common/Sekiro/sekiro.exe: Exec format error

Adding process 13044 for game ID 814380
JS method call FriendSettings.RegisterForSettingsChanges with 1 arguments
JS method call WebChat.RegisterForPushToTalkStateChange with 1 arguments
JS method call WebChat.SetVoiceChatActive with 1 arguments
JS method call WebChat.RegisterForComputerActiveStateChange with 1 arguments
JS method call WebChat.RegisterForFriendPostMessage with 1 arguments
JS method call SharedConnection.AllocateSharedConnection with 1 arguments
JS method call WebChat.RegisterOverlayChatBrowserInfoChanged with 1 arguments
JS method call FriendSettings.GetEnabledFeatures with 1 arguments
assert_20190417121936_25.dmp[13035]: Finished uploading minidump (out-of-process): success = yes
assert_20190417121936_25.dmp[13035]: response: CrashID=bp-d75c417e-e8de-45a1-97dd-829152190417
assert_20190417121936_25.dmp[13035]: file ‘’/tmp/dumps/assert_20190417121936_25.dmp’’, upload yes: ‘‘CrashID=bp-d75c417e-e8de-45a1-97dd-829152190417’’
JS method call SharedConnection.SubscribeToEMsg with 2 arguments
JS method call SharedConnection.SubscribeToEMsg with 2 arguments
JS method call SharedConnection.SubscribeToEMsg with 2 arguments
JS method call SharedConnection.SubscribeToEMsg with 2 arguments
JS method call SharedConnection.SubscribeToEMsg with 2 arguments
JS method call SharedConnection.SubscribeToEMsg with 2 arguments
JS method call SharedConnection.SubscribeToEMsg with 2 arguments
JS method call SharedConnection.SubscribeToEMsg with 2 arguments
JS method call SharedConnection.SubscribeToClientServiceMethod with 2 arguments
JS method call SharedConnection.SubscribeToClientServiceMethod with 2 arguments
JS method call SharedConnection.SubscribeToClientServiceMethod with 2 arguments
JS method call SharedConnection.SubscribeToClientServiceMethod with 2 arguments
JS method call SharedConnection.SubscribeToClientServiceMethod with 2 arguments
JS method call SharedConnection.SubscribeToClientServiceMethod with 2 arguments
JS method call SharedConnection.SubscribeToClientServiceMethod with 2 arguments
JS method call SharedConnection.SubscribeToClientServiceMethod with 2 arguments
JS method call SharedConnection.SubscribeToClientServiceMethod with 2 arguments
JS method call SharedConnection.SubscribeToClientServiceMethod with 2 arguments
JS method call SharedConnection.SubscribeToClientServiceMethod with 2 arguments
JS method call SharedConnection.SubscribeToClientServiceMethod with 2 arguments
JS method call SharedConnection.SubscribeToClientServiceMethod with 2 arguments
JS method call SharedConnection.SubscribeToClientServiceMethod with 2 arguments
JS method call SharedConnection.SubscribeToClientServiceMethod with 2 arguments
JS method call SharedConnection.SubscribeToClientServiceMethod with 2 arguments
JS method call SharedConnection.SubscribeToClientServiceMethod with 2 arguments
JS method call SharedConnection.SubscribeToClientServiceMethod with 2 arguments
JS method call SharedConnection.SubscribeToClientServiceMethod with 2 arguments
JS method call SharedConnection.SubscribeToClientServiceMethod with 2 arguments
JS method call SharedConnection.SubscribeToClientServiceMethod with 2 arguments
JS method call SharedConnection.SubscribeToClientServiceMethod with 2 arguments
JS method call SharedConnection.SubscribeToClientServiceMethod with 2 arguments
JS method call SharedConnection.SubscribeToClientServiceMethod with 2 arguments
JS method call SharedConnection.SubscribeToClientServiceMethod with 2 arguments
JS method call SharedConnection.SubscribeToClientServiceMethod with 2 arguments
JS method call SharedConnection.SubscribeToClientServiceMethod with 2 arguments
JS method call SharedConnection.RegisterOnLogonInfoChanged with 2 arguments
Game removed: AppID 814380 “”, ProcID 13039
JS method call SharedConnection.SendMsgAndAwaitResponse with 3 arguments
JS method call Storage.GetString with 2 arguments
JS method call SharedConnection.SendMsgAndAwaitResponse with 3 arguments
JS method call Storage.GetString with 2 arguments
JS method call Storage.GetString with 2 arguments
JS method call Storage.GetString with 2 arguments
JS method call Storage.GetString with 2 arguments
JS method call Storage.GetString with 2 arguments
JS method call SharedConnection.SendMsgAndAwaitResponse with 3 arguments
JS method call SharedConnection.SendMsgAndAwaitResponse with 3 arguments
JS method call WebChat.GetOverlayChatBrowserInfo with 1 arguments
JS method call Parental.RegisterForParentalSettingsChanges with 1 arguments
JS method call Broadcast.RegisterForBroadcastStatus with 1 arguments
JS method call Broadcast.RegisterForViewerRequests with 1 arguments
JS method call SharedConnection.SendMsgAndAwaitResponse with 3 arguments
JS method call SharedConnection.RegisterOnMessageReceived with 2 arguments
JS method call SharedConnection.SendMsg with 2 arguments
JS method call WebChat.GetPushToTalkEnabled with 1 arguments
JS method call SharedConnection.SendMsgAndAwaitResponse with 3 arguments
JS method call SharedConnection.SendMsgAndAwaitResponse with 3 arguments
JS method call Storage.GetString with 2 arguments
JS method call Storage.GetString with 2 arguments
JS method call SharedConnection.SendMsgAndAwaitResponse with 3 arguments
JS method call SharedConnection.SendMsgAndAwaitResponse with 3 arguments
JS method call SharedConnection.SendMsg with 2 arguments
JS method call SharedConnection.SendMsgAndAwaitResponse with 3 arguments
JS method call SharedConnection.SendMsgAndAwaitResponse with 3 arguments
JS method call SharedConnection.SendMsg with 2 arguments
JS method call WebChat.SetNumChatsWithUnreadPriorityMessages with 1 arguments
JS method call SharedConnection.SendMsgAndAwaitResponse with 3 arguments
JS method call Storage.GetString with 2 arguments
JS method call WebChat.BSuppressPopupsInRestore with 1 arguments
Installing breakpad exception handler for appid(steam)/version(1550534751)

0 Likes

#10

Well the log seems to be different compared to the first one you posted, this time you’ve got permission errors

sh: 1: /home/caleb/.local/share/Steam/steamapps/common/Sekiro: Permission denied
sh: 1: /home/caleb/.local/share/Steam/steamapps/common/Steamworks Shared: Permission denied

Which is a good sign I guess, the files exist but either the file permissions are incorrect or apparmor is playing tricks on you (doubt the latter).

Check the file permissions or delete them to allow steam to re-create them.

Going to bed checking back tomorrow.

0 Likes

#11

I changed the permissions for both folders and ran it again. There is no but the result is the same, black window then immediately crash.

Thanks for all your help

0 Likes

#12

Deleted the files and re-downloading now

0 Likes

#13

Seem to be having the same result as before. The black window seems to crash right around

maybe that helps. I’m still not sure, its strange because on the ProtonDB most people get the game running with no issue.

0 Likes